{"text_format":"1","workbook":"xlsx","n_sheets":9,"sheets":["7 day speed and Vol Summary","RAMM Traffic and Loading Table","Input","Input2","Peaks","Peaks2","Volume","Volume 2","Count Programme"],"not_rendered":{"charts":2,"images":0,"macros":1,"external_links":0,"defined_names":22,"comments":0,"pivot_tables":0},"unopened":[],"bounds":{"document_bytes":16777216,"sheet_cells":100000,"rows_first":2000,"rows_last":500,"rows_between":2000,"halvings":0,"cell_chars":16384,"cell_head_chars":4096},"cells_cut":0,"cells_raw":0,"read":"whole","date_system":"1900"}

{"sheet":"7 day speed and Vol Summary","index":0,"n_rows":169,"n_cols":35,"rows_kept":169,"cut":false,"hidden":false,"merged":[[11,19,11,34],[11,3,11,18],[38,17,38,18],[50,3,50,18],[50,19,50,34],[24,19,24,34],[37,3,37,18],[37,19,37,34],[24,3,24,18],[12,17,12,18],[25,17,25,18],[89,19,89,34],[63,19,63,34],[64,17,64,18],[76,3,76,18],[76,19,76,34],[77,17,77,18],[89,3,89,18],[63,3,63,18],[90,17,90,18],[149,4,149,10],[149,11,149,17],[149,1,150,3],[3,16,3,17],[4,16,4,17],[6,16,6,17],[7,16,7,17],[5,16,5,17],[51,17,51,18],[5,4,5,5],[5,6,5,7],[5,8,5,9],[5,10,5,11]]}
[null,{"$f":"IF(Input2!A1=\"\",\"2Lane\",\"Multi\")","v":"2Lane"},null,null,null,null,null,null,null,null,null,null,null,null,null,null,{"$f":"E4&\" - \"&E7&\" to \"&E8&\" (\"&LEFT(E6,8)&\"-\"&LEFT(G6,8)&\")\"&TEXT(B15,\" yyyy-mmm\")&\".xlsm\"","v":"VIPOND RD (STANMORE BAY)  (10994) - DUNCANSBY RD to COOPER RD (E1753938-N5946454) 2024-Oct.xlsm"}]
[null,"Auckland Transport",null,null,null,null,null,null,null,null,null,null,null,null,null,null,null,null,null,null,null,null,null,"Direction:",null,null,"P","S",{"$f":"Input2!B15","v":0},{"$f":"Input2!B16","v":0},null,null,"2013-10-07"]
[null,"Count Programme Site ID:",null,null,"ATC9",null,null,null,null,null,null,null,null,null,null,"Location:",{"$f":"Input!B4","v":"-36.615015, 174.721501 [50] 1753938, 5946454"}]
[null,"Road Name:",null,null,{"$f":"Input!B2","v":"VIPOND RD (STANMORE BAY)  (10994)"},null,null,null,null,null,null,null,null,null,null,"Carriageway ID:",{"$f":"IFERROR(VLOOKUP($E$3,Programme,6,0),\"\")","v":4376}]
[null,null,null,null,null,null,null,null,null,null,null,null,null,null,null,"Road ID:",{"$f":"IFERROR(VLOOKUP($E$3,Programme,2,0),\"\")","v":10994}]
[null,"GPS Location:",null,null,{"$f":"IFERROR(LEFT(Input!B3,FIND(\" \",Input!B3)-1),\"\")","v":"E1753938"},null,{"$f":"IFERROR(RIGHT(Input!B3,LEN(Input!B3)-FIND(\" \",Input!B3)),\"\")","v":"N5946454"},null,{"$f":"IF(CountID2=\"\",\"\",IFERROR(LEFT(Input2!B3,FIND(\" \",Input2!B3)-1),\"\"))","v":""},null,{"$f":"IF(CountID2=\"\",\"\",IFERROR(RIGHT(Input2!B3,LEN(Input2!B3)-FIND(\" \",Input2!B3)),\"\"))","v":""},null,null,null,null,"Carriageway start:",{"$f":"IFERROR(VLOOKUP($E$3,Programme,4,0),\"\")","v":752}]
[null,"Carriageway Start Name:",null,null,{"$f":"Input!B5","v":"DUNCANSBY RD"},null,null,null,{"$f":"IF(CountID2=\"\",\"\",Input2!B5)","v":""},null,null,null,null,null,null,"Posted Speed Limit (Kph):",{"$f":"Input!B7","v":"50 "},null,null,null,{"$f":"IF(CountID2=\"\",\"\",Input2!B7)","v":""}]
[null,"Carriageway End Name:",null,null,{"$f":"Input!B6","v":"COOPER RD"},null,null,null,{"$f":"IF(CountID2=\"\",\"\",Input2!B6)","v":""},null,null,null,null,null,null,"Count Start Date:",{"$f":"IFERROR(IF(E4=\"\",\"\",B15),\"\")","v":"2024-10-30"}]
[null,"Note:"]
[]
{"$rows_left_out":160}
{"sheet":"RAMM Traffic and Loading Table","index":1,"n_rows":43,"n_cols":3,"rows_kept":43,"cut":false,"hidden":false,"merged":[]}
["Data to upload to RAMM"]
["Road ID",{"$f":"IFERROR(VLOOKUP(CountID,Programme,2,0),\"\")","v":10994},{"$f":"IFERROR(VLOOKUP(CountID2,Programme,2,0),\"\")","v":""}]
["Carraigeway Start",{"$f":"IFERROR(VLOOKUP(CountID,Programme,4,0),\"\")","v":752},{"$f":"IFERROR(VLOOKUP(CountID2,Programme,4,0),\"\")","v":""}]
["Direction","B",{"$f":"IF(CountID2=\"\",\"\",\"B\")","v":""}]
["Northing",{"$f":"GPS('7 day speed and Vol Summary'!G6)","v":"5946454"},{"$f":"IF(CountID2=\"\",\"\",GPS('7 day speed and Vol Summary'!K6))","v":""}]
["Easting",{"$f":"GPS('7 day speed and Vol Summary'!E6)","v":"1753938"},{"$f":"IF(CountID2=\"\",\"\",GPS('7 day speed and Vol Summary'!I6))","v":""}]
["Latest","L",{"$f":"IF(CountID2=\"\",\"\",\"L\")","v":""}]
["Count Date",{"$f":"'7 day speed and Vol Summary'!Q8","v":"2024-10-30"},{"$f":"IF(CountID2=\"\",\"\",'7 day speed and Vol Summary'!B54)","v":""}]
["Count Status","C",{"$f":"IF(CountID2=\"\",\"\",\"C\")","v":""}]
["Peak Hour",{"$f":"IF(Type=\"2Lane\",OFFSET(Peaks,MATCH(B14,TwoLane,0),0),IF(CountID2=\"\",OFFSET(Peaks2,MATCH(B14,Multi,0),0),OFFSET(Peaks2,MATCH(B14,TwoLane,0),0)))","v":1645},{"$f":"IF(CountID2=\"\",\"\",OFFSET(Peaks2!$C$3,MATCH(C14,SecondCount,0),0))","v":""}]
{"$rows_left_out":34}
{"sheet":"Input","index":2,"n_rows":543,"n_cols":39,"rows_kept":543,"cut":false,"hidden":true,"merged":[]}
["Auckland Transport"]
[" Site Name ","VIPOND RD (STANMORE BAY)  (10994)"]
[" Site Attribute ","E1753938 N5946454"]
[" Description ","-36.615015, 174.721501 [50] 1753938, 5946454"]
["Start","DUNCANSBY RD"]
["End","COOPER RD"]
[" Posted Limit ","50 "]
[" Mean   ","Average speed"]
[]
["Wednesday, October 30, 2024"]
{"$rows_left_out":534}
{"sheet":"Input2","index":3,"n_rows":0,"n_cols":0,"rows_kept":0,"cut":false,"hidden":true,"merged":[]}

{"sheet":"Peaks","index":4,"n_rows":60,"n_cols":31,"rows_kept":60,"cut":false,"hidden":false,"merged":[[1,20,1,26],[1,28,1,30],[20,1,39,1],[41,1,59,1],[1,4,1,10],[1,12,1,18],[3,1,18,1]]}
[]
[null,null,null,null,{"$f":"IF(Input2!$A$1=\"\",\"Direction 1\",\"Direction 1 / Lane1\")","v":"Direction 1"},null,null,null,null,null,null,null,{"$f":"IF(Input2!$A$1=\"\",\"Direction 2\",\"Direction 1 / Lane2\")","v":"Direction 2"},null,null,null,null,null,null,null,{"$f":"IF(Input2!$A$1=\"\",\"Both Directions\",\"Direction 1 / Both Lanes\")","v":"Both Directions"},null,null,null,null,null,null,null,"Daily Maximums"]
[null,null,null,null,{"$f":"LEFT(Input!$A$10,3)","v":"Wed"},{"$f":"LEFT(Input!$A$73,3)","v":"Thu"},{"$f":"LEFT(Input!$A$136,3)","v":"Fri"},{"$f":"LEFT(Input!$A$199,3)","v":"Sat"},{"$f":"LEFT(Input!$A$262,3)","v":"Sun"},{"$f":"LEFT(Input!$A$325,3)","v":"Mon"},{"$f":"LEFT(Input!$A$388,3)","v":"Tue"},null,{"$f":"LEFT(Input!$A$10,3)","v":"Wed"},{"$f":"LEFT(Input!$A$73,3)","v":"Thu"},{"$f":"LEFT(Input!$A$136,3)","v":"Fri"},{"$f":"LEFT(Input!$A$199,3)","v":"Sat"},{"$f":"LEFT(Input!$A$262,3)","v":"Sun"},{"$f":"LEFT(Input!$A$325,3)","v":"Mon"},{"$f":"LEFT(Input!$A$388,3)","v":"Tue"},null,{"$f":"LEFT(Input!$A$10,3)","v":"Wed"},{"$f":"LEFT(Input!$A$73,3)","v":"Thu"},{"$f":"LEFT(Input!$A$136,3)","v":"Fri"},{"$f":"LEFT(Input!$A$199,3)","v":"Sat"},{"$f":"LEFT(Input!$A$262,3)","v":"Sun"},{"$f":"LEFT(Input!$A$325,3)","v":"Mon"},{"$f":"LEFT(Input!$A$388,3)","v":"Tue"},null,{"$f":"IF(Input2!$A$1=\"\",\"Direction 1\",\"Dir1/Lane1\")","v":"Direction 1"},{"$f":"IF(Input2!$A$1=\"\",\"Direction 2\",\"Dir1/Lane2\")","v":"Direction 2"},{"$f":"IF(Input2!$A$1=\"\",\"Both\",\"Dir1/Both\")","v":"Both"}]
[null,"Morning","0515","0615",{"$f":"SUM(Input!$S$26:$U$26,Input!$R$28)","v":13},{"$f":"SUM(Input!$S$89:$U$89,Input!$R$91)","v":17},{"$f":"SUM(Input!$S$152:$U$152,Input!$R$154)","v":31},{"$f":"SUM(Input!$S$215:$U$215,Input!$R$217)","v":14},{"$f":"SUM(Input!$S$278:$U$278,Input!$R$280)","v":5},{"$f":"SUM(Input!$S$341:$U$341,Input!$R$343)","v":19},{"$f":"SUM(Input!$S$404:$U$404,Input!$R$406)","v":27},null,{"$f":"SUM(Input!$S$25:$U$25,Input!$R$27)","v":250},{"$f":"SUM(Input!$S$88:$U$88,Input!$R$90)","v":231},{"$f":"SUM(Input!$S$151:$U$151,Input!$R$153)","v":231},{"$f":"SUM(Input!$S$214:$U$214,Input!$R$216)","v":58},{"$f":"SUM(Input!$S$277:$U$277,Input!$R$279)","v":31},{"$f":"SUM(Input!$S$340:$U$340,Input!$R$342)","v":241},{"$f":"SUM(Input!$S$403:$U$403,Input!$R$405)","v":236},null,{"$f":"E4+M4","v":263},{"$f":"F4+N4","v":248},{"$f":"G4+O4","v":262},{"$f":"H4+P4","v":72},{"$f":"I4+Q4","v":36},{"$f":"J4+R4","v":260},{"$f":"K4+S4","v":263},null,{"$f":"MAX(E4:K4)","v":31},{"$f":"MAX(M4:S4)","v":250},{"$f":"MAX(U4:AA4)","v":263}]
[null,null,"0530","0630",{"$f":"SUM(Input!$T$26:$U$26,Input!$R$28:$S$28)","v":15},{"$f":"SUM(Input!$T$89:$U$89,Input!$R$91:$S$91)","v":22},{"$f":"SUM(Input!$T$152:$U$152,Input!$R$154:$S$154)","v":35},{"$f":"SUM(Input!$T$215:$U$215,Input!$R$217:$S$217)","v":18},{"$f":"SUM(Input!$T$278:$U$278,Input!$R$280:$S$280)","v":7},{"$f":"SUM(Input!$T$341:$U$341,Input!$R$343:$S$343)","v":19},{"$f":"SUM(Input!$T$404:$U$404,Input!$R$406:$S$406)","v":31},null,{"$f":"SUM(Input!$T$25:$U$25,Input!$R$27:$S$27)","v":301},{"$f":"SUM(Input!$T$88:$U$88,Input!$R$90:$S$90)","v":302},{"$f":"SUM(Input!$T$151:$U$151,Input!$R$153:$S$153)","v":271},{"$f":"SUM(Input!$T$214:$U$214,Input!$R$216:$S$216)","v":74},{"$f":"SUM(Input!$T$277:$U$277,Input!$R$279:$S$279)","v":38},{"$f":"SUM(Input!$T$340:$U$340,Input!$R$342:$S$342)","v":302},{"$f":"SUM(Input!$T$403:$U$403,Input!$R$405:$S$405)","v":316},null,316,324,306,92,45,321,347,null,35,316,{"$f":"MAX(U5:AA5)","v":347}]
[null,null,"0545","0645",{"$f":"SUM(Input!$U$26,Input!$R$28:$T$28)","v":26},{"$f":"SUM(Input!$U$89,Input!$R$91:$T$91)","v":29},{"$f":"SUM(Input!$U$152,Input!$R$154:$T$154)","v":40},{"$f":"SUM(Input!$U$215,Input!$R$217:$T$217)","v":24},{"$f":"SUM(Input!$U$278,Input!$R$280:$T$280)","v":14},{"$f":"SUM(Input!$U$341,Input!$R$343:$T$343)","v":30},{"$f":"SUM(Input!$U$404,Input!$R$406:$T$406)","v":36},null,{"$f":"SUM(Input!$U$25,Input!$R$27:$T$27)","v":381},{"$f":"SUM(Input!$U$88,Input!$R$90:$T$90)","v":394},{"$f":"SUM(Input!$U$151,Input!$R$153:$T$153)","v":343},{"$f":"SUM(Input!$U$214,Input!$R$216:$T$216)","v":83},{"$f":"SUM(Input!$U$277,Input!$R$279:$T$279)","v":47},{"$f":"SUM(Input!$U$340,Input!$R$342:$T$342)","v":381},{"$f":"SUM(Input!$U$403,Input!$R$405:$T$405)","v":419},null,407,423,383,107,61,411,455,null,40,419,455]
[null,null,"0600","0700",{"$f":"SUM(Input!$R$28:$U$28)","v":42},{"$f":"SUM(Input!$R$91:$U$91)","v":41},{"$f":"SUM(Input!$R$154:$U$154)","v":54},{"$f":"SUM(Input!$R$217:$U$217)","v":24},{"$f":"SUM(Input!$R$280:$U$280)","v":17},{"$f":"SUM(Input!$R$343:$U$343)","v":45},{"$f":"SUM(Input!$R$406:$U$406)","v":46},null,{"$f":"SUM(Input!$R$27:$U$27)","v":454},{"$f":"SUM(Input!$R$90:$U$90)","v":491},{"$f":"SUM(Input!$R$153:$U$153)","v":424},{"$f":"SUM(Input!$R$216:$U$216)","v":97},{"$f":"SUM(Input!$R$279:$U$279)","v":53},{"$f":"SUM(Input!$R$342:$U$342)","v":459},{"$f":"SUM(Input!$R$405:$U$405)","v":491},null,496,532,478,121,70,504,537,null,54,491,537]
[null,null,"0615","0715",{"$f":"SUM(Input!$S$28:$U$28,Input!$R$30)","v":51},{"$f":"SUM(Input!$S$91:$U$91,Input!$R$93)","v":52},{"$f":"SUM(Input!$S$154:$U$154,Input!$R$156)","v":62},{"$f":"SUM(Input!$S$217:$U$217,Input!$R$219)","v":32},{"$f":"SUM(Input!$S$280:$U$280,Input!$R$282)","v":19},{"$f":"SUM(Input!$S$343:$U$343,Input!$R$345)","v":59},{"$f":"SUM(Input!$S$406:$U$406,Input!$R$408)","v":54},null,{"$f":"SUM(Input!$S$27:$U$27,Input!$R$29)","v":525},{"$f":"SUM(Input!$S$90:$U$90,Input!$R$92)","v":546},{"$f":"SUM(Input!$S$153:$U$153,Input!$R$155)","v":492},{"$f":"SUM(Input!$S$216:$U$216,Input!$R$218)","v":91},{"$f":"SUM(Input!$S$279:$U$279,Input!$R$281)","v":62},{"$f":"SUM(Input!$S$342:$U$342,Input!$R$344)","v":521},{"$f":"SUM(Input!$S$405:$U$405,Input!$R$407)","v":558},null,576,598,554,123,81,580,612,null,62,558,612]
[null,null,"0630","0730",{"$f":"SUM(Input!$T$28:$U$28,Input!$R$30:$S$30)","v":66},{"$f":"SUM(Input!$T$91:$U$91,Input!$R$93:$S$93)","v":62},{"$f":"SUM(Input!$T$154:$U$154,Input!$R$156:$S$156)","v":79},{"$f":"SUM(Input!$T$217:$U$217,Input!$R$219:$S$219)","v":41},{"$f":"SUM(Input!$T$280:$U$280,Input!$R$282:$S$282)","v":28},{"$f":"SUM(Input!$T$343:$U$343,Input!$R$345:$S$345)","v":77},{"$f":"SUM(Input!$T$406:$U$406,Input!$R$408:$S$408)","v":66},null,{"$f":"SUM(Input!$T$27:$U$27,Input!$R$29:$S$29)","v":569},{"$f":"SUM(Input!$T$90:$U$90,Input!$R$92:$S$92)","v":595},{"$f":"SUM(Input!$T$153:$U$153,Input!$R$155:$S$155)","v":541},{"$f":"SUM(Input!$T$216:$U$216,Input!$R$218:$S$218)","v":103},{"$f":"SUM(Input!$T$279:$U$279,Input!$R$281:$S$281)","v":73},{"$f":"SUM(Input!$T$342:$U$342,Input!$R$344:$S$344)","v":557},{"$f":"SUM(Input!$T$405:$U$405,Input!$R$407:$S$407)","v":577},null,635,657,620,144,101,634,643,null,79,595,657]
[null,null,"0645","0745",{"$f":"SUM(Input!$U$28,Input!$R$30:$T$30)","v":81},{"$f":"SUM(Input!$U$91,Input!$R$93:$T$93)","v":85},{"$f":"SUM(Input!$U$154,Input!$R$156:$T$156)","v":99},{"$f":"SUM(Input!$U$217,Input!$R$219:$T$219)","v":45},{"$f":"SUM(Input!$U$280,Input!$R$282:$T$282)","v":27},{"$f":"SUM(Input!$U$343,Input!$R$345:$T$345)","v":99},{"$f":"SUM(Input!$U$406,Input!$R$408:$T$408)","v":84},null,{"$f":"SUM(Input!$U$27,Input!$R$29:$T$29)","v":546},{"$f":"SUM(Input!$U$90,Input!$R$92:$T$92)","v":568},{"$f":"SUM(Input!$U$153,Input!$R$155:$T$155)","v":537},{"$f":"SUM(Input!$U$216,Input!$R$218:$T$218)","v":132},{"$f":"SUM(Input!$U$279,Input!$R$281:$T$281)","v":85},{"$f":"SUM(Input!$U$342,Input!$R$344:$T$344)","v":552},{"$f":"SUM(Input!$U$405,Input!$R$407:$T$407)","v":537},null,627,653,636,177,112,651,621,null,99,568,653]
{"$rows_left_out":51}
{"sheet":"Peaks2","index":5,"n_rows":60,"n_cols":40,"rows_kept":60,"cut":false,"hidden":true,"merged":[[1,36,1,39],[1,28,1,34],[41,1,59,1],[1,4,1,10],[1,12,1,18],[1,20,1,26],[3,1,18,1],[20,1,39,1]]}
[]
[null,null,null,null,"Direction 2 / Lane1",null,null,null,null,null,null,null,"Direction 2 / Lane2",null,null,null,null,null,null,null,"Direction 2 / Both Lanes",null,null,null,null,null,null,null,"All Lanes",null,null,null,null,null,null,null,"Daily Maximums"]
[null,null,null,null,{"$f":"LEFT(Input2!$A$10,3)","v":""},{"$f":"LEFT(Input2!$A$73,3)","v":""},{"$f":"LEFT(Input2!$A$136,3)","v":""},{"$f":"LEFT(Input2!$A$199,3)","v":""},{"$f":"LEFT(Input2!$A$262,3)","v":""},{"$f":"LEFT(Input2!$A$325,3)","v":""},{"$f":"LEFT(Input2!$A$388,3)","v":""},null,{"$f":"LEFT(Input2!$A$10,3)","v":""},{"$f":"LEFT(Input2!$A$73,3)","v":""},{"$f":"LEFT(Input2!$A$136,3)","v":""},{"$f":"LEFT(Input2!$A$199,3)","v":""},{"$f":"LEFT(Input2!$A$262,3)","v":""},{"$f":"LEFT(Input2!$A$325,3)","v":""},{"$f":"LEFT(Input2!$A$388,3)","v":""},null,{"$f":"LEFT(Input2!$A$10,3)","v":""},{"$f":"LEFT(Input2!$A$73,3)","v":""},{"$f":"LEFT(Input2!$A$136,3)","v":""},{"$f":"LEFT(Input2!$A$199,3)","v":""},{"$f":"LEFT(Input2!$A$262,3)","v":""},{"$f":"LEFT(Input2!$A$325,3)","v":""},{"$f":"LEFT(Input2!$A$388,3)","v":""},null,{"$f":"LEFT(Input2!$A$10,3)","v":""},{"$f":"LEFT(Input2!$A$73,3)","v":""},{"$f":"LEFT(Input2!$A$136,3)","v":""},{"$f":"LEFT(Input2!$A$199,3)","v":""},{"$f":"LEFT(Input2!$A$262,3)","v":""},{"$f":"LEFT(Input2!$A$325,3)","v":""},{"$f":"LEFT(Input2!$A$388,3)","v":""},null,"Dir2/Lane1","Dir2/Lane2","Dir2/Both","All Lanes"]
[null,"Morning","0515","0615",null,null,null,null,null,null,null,null,null,null,null,null,null,null,null,null,null,null,null,null,null,null,null,null,null,null,null,null,null,null,null,null,{"$f":"MAX(E4:K4)","v":0},{"$f":"MAX(M4:S4)","v":0},{"$f":"MAX(U4:AA4)","v":0},{"$f":"MAX(AC4:AI4)","v":0}]
[null,null,"0530","0630",null,null,null,null,null,null,null,null,null,null,null,null,null,null,null,null,null,null,null,null,null,null,null,null,null,null,null,null,null,null,null,null,0,0,0,0]
[null,null,"0545","0645",null,null,null,null,null,null,null,null,null,null,null,null,null,null,null,null,null,null,null,null,null,null,null,null,null,null,null,null,null,null,null,null,0,0,0,0]
[null,null,"0600","0700",null,null,null,null,null,null,null,null,null,null,null,null,null,null,null,null,null,null,null,null,null,null,null,null,null,null,null,null,null,null,null,null,0,0,0,0]
[null,null,"0615","0715",null,null,null,null,null,null,null,null,null,null,null,null,null,null,null,null,null,null,null,null,null,null,null,null,null,null,null,null,null,null,null,null,0,0,0,0]
[null,null,"0630","0730",null,null,null,null,null,null,null,null,null,null,null,null,null,null,null,null,null,null,null,null,null,null,null,null,null,null,null,null,null,null,null,null,0,0,0,0]
[null,null,"0645","0745",null,null,null,null,null,null,null,null,null,null,null,null,null,null,null,null,null,null,null,null,null,null,null,null,null,null,null,null,null,null,null,null,0,0,0,0]
{"$rows_left_out":51}
{"sheet":"Volume","index":6,"n_rows":26,"n_cols":3,"rows_kept":26,"cut":false,"hidden":false,"merged":[]}
[]
[null,"Hour","Volume"]
[null,0,{"$f":"IFERROR(ROUND(AVERAGEIF(Input!$A$12:$A$448,0,Input!$C$12:$C$448)*2,0),0)","v":24}]
[null,100,{"$f":"IFERROR(ROUND(AVERAGEIF(Input!$A$12:$A$448,100,Input!$C$12:$C$448)*2,0),0)","v":13}]
[null,200,{"$f":"IFERROR(ROUND(AVERAGEIF(Input!$A$12:$A$448,200,Input!$C$12:$C$448)*2,0),0)","v":8}]
[null,300,{"$f":"IFERROR(ROUND(AVERAGEIF(Input!$A$12:$A$448,300,Input!$C$12:$C$448)*2,0),0)","v":15}]
[null,400,{"$f":"IFERROR(ROUND(AVERAGEIF(Input!$A$12:$A$448,400,Input!$C$12:$C$448)*2,0),0)","v":32}]
[null,500,{"$f":"IFERROR(ROUND(AVERAGEIF(Input!$A$12:$A$448,500,Input!$C$12:$C$448)*2,0),0)","v":151}]
[null,600,{"$f":"IFERROR(ROUND(AVERAGEIF(Input!$A$12:$A$448,600,Input!$C$12:$C$448)*2,0),0)","v":391}]
[null,700,{"$f":"IFERROR(ROUND(AVERAGEIF(Input!$A$12:$A$448,700,Input!$C$12:$C$448)*2,0),0)","v":514}]
{"$rows_left_out":17}
{"sheet":"Volume 2","index":7,"n_rows":26,"n_cols":3,"rows_kept":26,"cut":false,"hidden":true,"merged":[]}
[]
[null,"Hour","Volume"]
[null,0,{"$f":"IFERROR(ROUND(AVERAGEIF(Input2!$A$12:$A$448,0,Input2!$C$12:$C$448)*2,0),0)","v":0}]
[null,100,{"$f":"IFERROR(ROUND(AVERAGEIF(Input2!$A$12:$A$448,100,Input2!$C$12:$C$448)*2,0),0)","v":0}]
[null,200,{"$f":"IFERROR(ROUND(AVERAGEIF(Input2!$A$12:$A$448,200,Input2!$C$12:$C$448)*2,0),0)","v":0}]
[null,300,{"$f":"IFERROR(ROUND(AVERAGEIF(Input2!$A$12:$A$448,300,Input2!$C$12:$C$448)*2,0),0)","v":0}]
[null,400,{"$f":"IFERROR(ROUND(AVERAGEIF(Input2!$A$12:$A$448,400,Input2!$C$12:$C$448)*2,0),0)","v":0}]
[null,500,{"$f":"IFERROR(ROUND(AVERAGEIF(Input2!$A$12:$A$448,500,Input2!$C$12:$C$448)*2,0),0)","v":0}]
[null,600,{"$f":"IFERROR(ROUND(AVERAGEIF(Input2!$A$12:$A$448,600,Input2!$C$12:$C$448)*2,0),0)","v":0}]
[null,700,{"$f":"IFERROR(ROUND(AVERAGEIF(Input2!$A$12:$A$448,700,Input2!$C$12:$C$448)*2,0),0)","v":0}]
{"$rows_left_out":17}
{"sheet":"Count Programme","index":8,"n_rows":22,"n_cols":25,"rows_kept":22,"cut":false,"hidden":true,"merged":[]}
["Count Site ID","Road ID","Road Name","Start","End","Carr_way No.","Start Name","End Name","Width","Number of Lanes","Pavement Type","Use","Traffic Management Level","Region","Area","Sub Area","Urban / Rural","Hierarchy","Final Hierarchy","ADT","Date","Sample Group","2014/15","2015/16","2016/17"]
["ATC1",11044,"WHANGAPARAOA RD  (11044)",3144,3850,6376,"POPLAR RD","DOBELL RD",13.1,2,"Thin Surfaced Flexible","ADT > 20000",">= 10,000 vpd Rural/>=15,000 v",null,"ALBANY","Hibiscus and Bays : Hibiscus Coast","Urban","ROAD - ARTERIAL","Regional",25667,"2013-10-15"]
["ATC2",11044,"WHANGAPARAOA RD  (11044)",3144,3850,6376,"POPLAR RD","DOBELL RD",13.1,2,"Thin Surfaced Flexible","ADT > 20000",">= 10,000 vpd Rural/>=15,000 v",null,"ALBANY","Hibiscus and Bays : Hibiscus Coast","Urban","ROAD - ARTERIAL","Regional",25667,"2013-10-15"]
["ATC3",22320,"GLENCOE RD  (22320)",871,950,8772,"JOHN DOWNS DR","SARTORS AVE",12.8,2,"Thin Surfaced Flexible","ADT 4000-10000","< 10,000 vpd Rural/<15,000 vpd",null,"ALBANY","Hibiscus and Bays : East Coast Bays","Urban","ROAD - COLLECTO","Arterial"]
["ATC4",40827,"HARBOUR VIEW RD (WAITAKERE)  (40827)",0,91,12115,"TE ATATU RD RAB","PRINGLE RD",10.3,2,"Thin Surfaced Flexible","ADT 2000-4000","< 10,000 vpd Rural/<15,000 vpd",null,"WAITAKERE","Henderson-Massey","Urban","ROAD - COLLECTO","Primary Collector",2654,"1986-07-11"]
["ATC5",40827,"HARBOUR VIEW RD (WAITAKERE)  (40827)",91,412,13390,"PRINGLE RD","BEACH RD RAB",10.3,2,"Thin Surfaced Flexible","ADT 2000-4000","< 10,000 vpd Rural/<15,000 vpd",null,"WAITAKERE","Henderson-Massey","Urban","ROAD - COLLECTO","Primary Collector",3183,"2020-10-14"]
["ATC6",40496,"RANUI STATION RD  (40496)",0,233,11547,"SWANSON RD","RANUI SCHOOL RD",10.5,2,"Thin Surfaced Flexible","ADT 2000-4000","< 10,000 vpd Rural/<15,000 vpd",null,"WAITAKERE","Henderson-Massey","Urban","ROAD - LOCAL","Primary Collector",2766,"2008-06-02"]
["ATC7",40496,"RANUI STATION RD  (40496)",233,321,11548,"RANUI SCHOOL RD","ROBERTSON RD",10.5,2,"Thin Surfaced Flexible","ADT 2000-4000","< 10,000 vpd Rural/<15,000 vpd",null,"WAITAKERE","Henderson-Massey","Urban","ROAD - LOCAL","Primary Collector"]
["ATC8",10994,"VIPOND RD (STANMORE BAY)  (10994)",752,1475,4376,"DUNCANSBY RD","COOPER RD",9.8000000000000007,2,"Thin Surfaced Flexible","ADT 4000-10000","< 10,000 vpd Rural/<15,000 vpd",null,"ALBANY","Hibiscus and Bays : Hibiscus Coast","Urban","ROAD - COLLECTO","Arterial",6694,"2011-11-11"]
["ATC9",10994,"VIPOND RD (STANMORE BAY)  (10994)",752,1475,4376,"DUNCANSBY RD","COOPER RD",9.8000000000000007,2,"Thin Surfaced Flexible","ADT 4000-10000","< 10,000 vpd Rural/<15,000 vpd",null,"ALBANY","Hibiscus and Bays : Hibiscus Coast","Urban","ROAD - COLLECTO","Arterial",6694,"2011-11-11",null,null,"2024-11-11"]
{"$rows_left_out":12}