{"text_format":"1","workbook":"xlsx","n_sheets":9,"sheets":["7 day speed and Vol Summary","RAMM Traffic and Loading Table","Input","Input2","Peaks","Peaks2","Volume","Volume 2","Count Programme"],"not_rendered":{"charts":2,"images":0,"macros":1,"external_links":0,"defined_names":22,"comments":0,"pivot_tables":0},"unopened":[],"bounds":{"document_bytes":16777216,"sheet_cells":100000,"rows_first":2000,"rows_last":500,"rows_between":2000,"halvings":0,"cell_chars":16384,"cell_head_chars":4096},"cells_cut":0,"cells_raw":0,"read":"whole","date_system":"1900"}

{"sheet":"7 day speed and Vol Summary","index":0,"n_rows":169,"n_cols":35,"rows_kept":169,"cut":false,"hidden":false,"merged":[[11,19,11,34],[11,3,11,18],[38,17,38,18],[50,3,50,18],[50,19,50,34],[24,19,24,34],[37,3,37,18],[37,19,37,34],[24,3,24,18],[12,17,12,18],[25,17,25,18],[89,19,89,34],[63,19,63,34],[64,17,64,18],[76,3,76,18],[76,19,76,34],[77,17,77,18],[89,3,89,18],[63,3,63,18],[90,17,90,18],[149,4,149,10],[149,11,149,17],[149,1,150,3],[3,16,3,17],[4,16,4,17],[6,16,6,17],[7,16,7,17],[5,16,5,17],[51,17,51,18],[5,4,5,5],[5,6,5,7],[5,8,5,9],[5,10,5,11]]}
[null,{"$f":"IF(Input2!A1=\"\",\"2Lane\",\"Multi\")","v":"2Lane"},null,null,null,null,null,null,null,null,null,null,null,null,null,null,{"$f":"E4&\" - \"&E7&\" to \"&E8&\" (\"&LEFT(E6,8)&\"-\"&LEFT(G6,8)&\")\"&TEXT(B15,\" yyyy-mmm\")&\".xlsm\"","v":"VIPOND RD (STANMORE BAY)  (10994) - DUNCANSBY RD to COOPER RD (E1753938-N5946454) 2024-Oct.xlsm"}]
[null,"Auckland Transport",null,null,null,null,null,null,null,null,null,null,null,null,null,null,null,null,null,null,null,null,null,"Direction:",null,null,"P","S",{"$f":"Input2!B15","v":0},{"$f":"Input2!B16","v":0},null,null,"2013-10-07"]
[null,"Count Programme Site ID:",null,null,"ATC9",null,null,null,null,null,null,null,null,null,null,"Location:",{"$f":"Input!B4","v":"-36.615015, 174.721501 [50] 1753938, 5946454"}]
[null,"Road Name:",null,null,{"$f":"Input!B2","v":"VIPOND RD (STANMORE BAY)  (10994)"},null,null,null,null,null,null,null,null,null,null,"Carriageway ID:",{"$f":"IFERROR(VLOOKUP($E$3,Programme,6,0),\"\")","v":4376}]
[null,null,null,null,null,null,null,null,null,null,null,null,null,null,null,"Road ID:",{"$f":"IFERROR(VLOOKUP($E$3,Programme,2,0),\"\")","v":10994}]
[null,"GPS Location:",null,null,{"$f":"IFERROR(LEFT(Input!B3,FIND(\" \",Input!B3)-1),\"\")","v":"E1753938"},null,{"$f":"IFERROR(RIGHT(Input!B3,LEN(Input!B3)-FIND(\" \",Input!B3)),\"\")","v":"N5946454"},null,{"$f":"IF(CountID2=\"\",\"\",IFERROR(LEFT(Input2!B3,FIND(\" \",Input2!B3)-1),\"\"))","v":""},null,{"$f":"IF(CountID2=\"\",\"\",IFERROR(RIGHT(Input2!B3,LEN(Input2!B3)-FIND(\" \",Input2!B3)),\"\"))","v":""},null,null,null,null,"Carriageway start:",{"$f":"IFERROR(VLOOKUP($E$3,Programme,4,0),\"\")","v":752}]
[null,"Carriageway Start Name:",null,null,{"$f":"Input!B5","v":"DUNCANSBY RD"},null,null,null,{"$f":"IF(CountID2=\"\",\"\",Input2!B5)","v":""},null,null,null,null,null,null,"Posted Speed Limit (Kph):",{"$f":"Input!B7","v":"50 "},null,null,null,{"$f":"IF(CountID2=\"\",\"\",Input2!B7)","v":""}]
[null,"Carriageway End Name:",null,null,{"$f":"Input!B6","v":"COOPER RD"},null,null,null,{"$f":"IF(CountID2=\"\",\"\",Input2!B6)","v":""},null,null,null,null,null,null,"Count Start Date:",{"$f":"IFERROR(IF(E4=\"\",\"\",B15),\"\")","v":"2024-10-30"}]
[null,"Note:"]
[]
[null,{"$f":"IF(Input2!A1=\"\",\"Direction 1: Towards \"&Input!B6,\"Direction 1/Lane 1 : Towards \"&Input!B6)","v":"Direction 1: Towards COOPER RD"}]
[null,null,null,"Summary of Speed Classification",null,null,null,null,null,null,null,null,null,null,null,null,null,null,null,"Summary of Vehicle Classification"]
[null,"Date",null,"<10","10-20","20-30","30-40","40-50","50-60","60-70","70-80","80-90","90-100","100-110","110-120","121+","Daily","85th Percentile",null,"CL1","CL2","CL3","CL4","CL5","CL6","CL7","CL8","CL9","CL10","CL11","CL12","CL13","CL14","Daily","%HCV"]
[null,{"$f":"IFERROR(TEXT(B15,\"MMMM\"),0)","v":"October"},"Day",null,null,null,null,null,null,null,null,null,null,null,null,null,"Total","Total","Speed",null,null,null,null,null,null,null,null,null,null,null,null,null,null,"Total"]
[null,{"$f":"IFERROR(DATEVALUE(RIGHT(Input!$A$10,LEN(Input!$A$10)-FIND(\",\",Input!$A$10)-1)),1)","v":"2024-10-30"},{"$f":"IFERROR(WEEKDAY(B15,2),0)","v":3},{"$f":"SUMIF(Input!$B$15:$B$62,$AA$2,Input!V$15:V$62)","v":0},{"$f":"SUMIF(Input!$B$15:$B$62,$AA$2,Input!W$15:W$62)","v":6},{"$f":"SUMIF(Input!$B$15:$B$62,$AA$2,Input!X$15:X$62)","v":48},{"$f":"SUMIF(Input!$B$15:$B$62,$AA$2,Input!Y$15:Y$62)","v":477},{"$f":"SUMIF(Input!$B$15:$B$62,$AA$2,Input!Z$15:Z$62)","v":2508},{"$f":"SUMIF(Input!$B$15:$B$62,$AA$2,Input!AA$15:AA$62)","v":1203},{"$f":"SUMIF(Input!$B$15:$B$62,$AA$2,Input!AB$15:AB$62)","v":61},{"$f":"SUMIF(Input!$B$15:$B$62,$AA$2,Input!AC$15:AC$62)","v":7},{"$f":"SUMIF(Input!$B$15:$B$62,$AA$2,Input!AD$15:AD$62)","v":0},{"$f":"SUMIF(Input!$B$15:$B$62,$AA$2,Input!AE$15:AE$62)","v":0},{"$f":"SUMIF(Input!$B$15:$B$62,$AA$2,Input!AF$15:AF$62)","v":0},{"$f":"SUMIF(Input!$B$15:$B$62,$AA$2,Input!AG$15:AG$62)","v":1},{"$f":"SUMPRODUCT((Input!$B$15:$B$62=$AA$2)*Input!AH$15:AK$62)","v":1},{"$f":"SUM(D15:P15)","v":4312},{"$f":"SUMIFS(Input!C$15:C$62,Input!AL$15:AL$62,\">0\",Input!B$15:B$62,\"P\")","v":4296},{"$f":"IFERROR(SUMPRODUCT((Input!B$15:B$62=\"P\")*Input!C$15:C$62*Input!AL$15:AL$62)/R15,0)","v":52.58880353817505},{"$f":"SUMIF(Input!$B$15:$B$62,$AA$2,Input!D$15:D$62)","v":21},{"$f":"SUMIF(Input!$B$15:$B$62,$AA$2,Input!E$15:E$62)","v":4076},{"$f":"SUMIF(Input!$B$15:$B$62,$AA$2,Input!F$15:F$62)","v":15},{"$f":"SUMIF(Input!$B$15:$B$62,$AA$2,Input!G$15:G$62)","v":39},{"$f":"SUMIF(Input!$B$15:$B$62,$AA$2,Input!H$15:H$62)","v":143},{"$f":"SUMIF(Input!$B$15:$B$62,$AA$2,Input!I$15:I$62)","v":4},{"$f":"SUMIF(Input!$B$15:$B$62,$AA$2,Input!J$15:J$62)","v":8},{"$f":"SUMIF(Input!$B$15:$B$62,$AA$2,Input!K$15:K$62)","v":4},{"$f":"SUMIF(Input!$B$15:$B$62,$AA$2,Input!L$15:L$62)","v":1},{"$f":"SUMIF(Input!$B$15:$B$62,$AA$2,Input!M$15:M$62)","v":0},{"$f":"SUMIF(Input!$B$15:$B$62,$AA$2,Input!N$15:N$62)","v":0},{"$f":"SUMIF(Input!$B$15:$B$62,$AA$2,Input!O$15:O$62)","v":0},{"$f":"SUMIF(Input!$B$15:$B$62,$AA$2,Input!P$15:P$62)","v":0},{"$f":"SUMIF(Input!$B$15:$B$62,$AA$2,Input!Q$15:Q$62)","v":1},{"$f":"SUM(T15:AG15)","v":4312},{"$f":"IFERROR(SUM(W15:AF15)/AH15,0)","v":4.6150278293135436E-2}]
[null,{"$f":"IFERROR(DATEVALUE(RIGHT(Input!$A$73,LEN(Input!$A$73)-FIND(\",\",Input!$A$73)-1)),2)","v":"2024-10-31"},{"$f":"IFERROR(WEEKDAY(B16,2),0)","v":4},{"$f":"SUMIF(Input!$B$78:$B$125,$AA$2,Input!V$78:V$125)","v":0},{"$f":"SUMIF(Input!$B$78:$B$125,$AA$2,Input!W$78:W$125)","v":4},{"$f":"SUMIF(Input!$B$78:$B$125,$AA$2,Input!X$78:X$125)","v":64},{"$f":"SUMIF(Input!$B$78:$B$125,$AA$2,Input!Y$78:Y$125)","v":463},{"$f":"SUMIF(Input!$B$78:$B$125,$AA$2,Input!Z$78:Z$125)","v":2766},{"$f":"SUMIF(Input!$B$78:$B$125,$AA$2,Input!AA$78:AA$125)","v":1380},{"$f":"SUMIF(Input!$B$78:$B$125,$AA$2,Input!AB$78:AB$125)","v":63},{"$f":"SUMIF(Input!$B$78:$B$125,$AA$2,Input!AC$78:AC$125)","v":6},{"$f":"SUMIF(Input!$B$78:$B$125,$AA$2,Input!AD$78:AD$125)","v":4},{"$f":"SUMIF(Input!$B$78:$B$125,$AA$2,Input!AE$78:AE$125)","v":2},{"$f":"SUMIF(Input!$B$78:$B$125,$AA$2,Input!AF$78:AF$125)","v":1},{"$f":"SUMIF(Input!$B$78:$B$125,$AA$2,Input!AG$78:AG$125)","v":0},{"$f":"SUMPRODUCT((Input!$B$78:$B$125=$AA$2)*Input!AH$78:AK$125)","v":0},4753,{"$f":"SUMIFS(Input!C$78:C$125,Input!AL$78:AL$125,\">0\",Input!B$78:B$125,\"P\")","v":4729},{"$f":"IFERROR(SUMPRODUCT((Input!B$78:B$125=\"P\")*Input!C$78:C$125*Input!AL$78:AL$125)/R16,0)","v":52.671283569464997},{"$f":"SUMIF(Input!$B$78:$B$125,$AA$2,Input!D$78:D$125)","v":38},{"$f":"SUMIF(Input!$B$78:$B$125,$AA$2,Input!E$78:E$125)","v":4511},{"$f":"SUMIF(Input!$B$78:$B$125,$AA$2,Input!F$78:F$125)","v":44},{"$f":"SUMIF(Input!$B$78:$B$125,$AA$2,Input!G$78:G$125)","v":44},{"$f":"SUMIF(Input!$B$78:$B$125,$AA$2,Input!H$78:H$125)","v":101},{"$f":"SUMIF(Input!$B$78:$B$125,$AA$2,Input!I$78:I$125)","v":3},{"$f":"SUMIF(Input!$B$78:$B$125,$AA$2,Input!J$78:J$125)","v":5},{"$f":"SUMIF(Input!$B$78:$B$125,$AA$2,Input!K$78:K$125)","v":2},{"$f":"SUMIF(Input!$B$78:$B$125,$AA$2,Input!L$78:L$125)","v":1},{"$f":"SUMIF(Input!$B$78:$B$125,$AA$2,Input!M$78:M$125)","v":1},{"$f":"SUMIF(Input!$B$78:$B$125,$AA$2,Input!N$78:N$125)","v":0},{"$f":"SUMIF(Input!$B$78:$B$125,$AA$2,Input!O$78:O$125)","v":0},{"$f":"SUMIF(Input!$B$78:$B$125,$AA$2,Input!P$78:P$125)","v":0},{"$f":"SUMIF(Input!$B$78:$B$125,$AA$2,Input!Q$78:Q$125)","v":3},{"$f":"SUM(T16:AG16)","v":4753},3.3031769408794445E-2]
[null,{"$f":"IFERROR(DATEVALUE(RIGHT(Input!$A$136,LEN(Input!$A$136)-FIND(\",\",Input!$A$136)-1)),3)","v":"2024-11-01"},5,{"$f":"SUMIF(Input!$B$141:$B$188,$AA$2,Input!V$141:V$188)","v":0},{"$f":"SUMIF(Input!$B$141:$B$188,$AA$2,Input!W$141:W$188)","v":12},{"$f":"SUMIF(Input!$B$141:$B$188,$AA$2,Input!X$141:X$188)","v":58},{"$f":"SUMIF(Input!$B$141:$B$188,$AA$2,Input!Y$141:Y$188)","v":443},{"$f":"SUMIF(Input!$B$141:$B$188,$AA$2,Input!Z$141:Z$188)","v":2531},{"$f":"SUMIF(Input!$B$141:$B$188,$AA$2,Input!AA$141:AA$188)","v":1410},{"$f":"SUMIF(Input!$B$141:$B$188,$AA$2,Input!AB$141:AB$188)","v":71},{"$f":"SUMIF(Input!$B$141:$B$188,$AA$2,Input!AC$141:AC$188)","v":6},{"$f":"SUMIF(Input!$B$141:$B$188,$AA$2,Input!AD$141:AD$188)","v":1},{"$f":"SUMIF(Input!$B$141:$B$188,$AA$2,Input!AE$141:AE$188)","v":0},{"$f":"SUMIF(Input!$B$141:$B$188,$AA$2,Input!AF$141:AF$188)","v":0},{"$f":"SUMIF(Input!$B$141:$B$188,$AA$2,Input!AG$141:AG$188)","v":0},{"$f":"SUMPRODUCT((Input!$B$141:$B$188=$AA$2)*Input!AH$141:AK$188)","v":0},4532,{"$f":"SUMIFS(Input!C$144:C$188,Input!AL$144:AL$188,\">0\",Input!B$144:B$188,\"P\")","v":4497},{"$f":"IFERROR(SUMPRODUCT((Input!B$141:B$188=\"P\")*Input!C$141:C$188*Input!AL$141:AL$188)/R17,0)","v":53.136980209028238},{"$f":"SUMIF(Input!$B$141:$B$188,$AA$2,Input!D$141:D$188)","v":46},{"$f":"SUMIF(Input!$B$141:$B$188,$AA$2,Input!E$141:E$188)","v":4303},{"$f":"SUMIF(Input!$B$141:$B$188,$AA$2,Input!F$141:F$188)","v":25},{"$f":"SUMIF(Input!$B$141:$B$188,$AA$2,Input!G$141:G$188)","v":52},{"$f":"SUMIF(Input!$B$141:$B$188,$AA$2,Input!H$141:H$188)","v":93},{"$f":"SUMIF(Input!$B$141:$B$188,$AA$2,Input!I$141:I$188)","v":5},{"$f":"SUMIF(Input!$B$141:$B$188,$AA$2,Input!J$141:J$188)","v":3},{"$f":"SUMIF(Input!$B$141:$B$188,$AA$2,Input!K$141:K$188)","v":2},{"$f":"SUMIF(Input!$B$141:$B$188,$AA$2,Input!L$141:L$188)","v":1},{"$f":"SUMIF(Input!$B$141:$B$188,$AA$2,Input!M$141:M$188)","v":0},{"$f":"SUMIF(Input!$B$141:$B$188,$AA$2,Input!N$141:N$188)","v":0},{"$f":"SUMIF(Input!$B$141:$B$188,$AA$2,Input!O$141:O$188)","v":0},{"$f":"SUMIF(Input!$B$141:$B$188,$AA$2,Input!P$141:P$188)","v":0},{"$f":"SUMIF(Input!$B$141:$B$188,$AA$2,Input!Q$141:Q$188)","v":2},4532,3.442188879082083E-2]
[null,{"$f":"IFERROR(DATEVALUE(RIGHT(Input!$A$199,LEN(Input!$A$199)-FIND(\",\",Input!$A$199)-1)),4)","v":"2024-11-02"},6,{"$f":"SUMIF(Input!$B$204:$B$251,$AA$2,Input!V$204:V$251)","v":0},{"$f":"SUMIF(Input!$B$204:$B$251,$AA$2,Input!W$204:W$251)","v":13},{"$f":"SUMIF(Input!$B$204:$B$251,$AA$2,Input!X$204:X$251)","v":34},{"$f":"SUMIF(Input!$B$204:$B$251,$AA$2,Input!Y$204:Y$251)","v":383},{"$f":"SUMIF(Input!$B$204:$B$251,$AA$2,Input!Z$204:Z$251)","v":1749},{"$f":"SUMIF(Input!$B$204:$B$251,$AA$2,Input!AA$204:AA$251)","v":1035},{"$f":"SUMIF(Input!$B$204:$B$251,$AA$2,Input!AB$204:AB$251)","v":61},{"$f":"SUMIF(Input!$B$204:$B$251,$AA$2,Input!AC$204:AC$251)","v":12},{"$f":"SUMIF(Input!$B$204:$B$251,$AA$2,Input!AD$204:AD$251)","v":1},{"$f":"SUMIF(Input!$B$204:$B$251,$AA$2,Input!AE$204:AE$251)","v":2},{"$f":"SUMIF(Input!$B$204:$B$251,$AA$2,Input!AF$204:AF$251)","v":0},{"$f":"SUMIF(Input!$B$204:$B$251,$AA$2,Input!AG$204:AG$251)","v":0},{"$f":"SUMPRODUCT((Input!$B$204:$B$251=$AA$2)*Input!AH$204:AK$251)","v":0},3290,{"$f":"SUMIFS(Input!C$204:C$251,Input!AL$204:AL$251,\">0\",Input!B$204:B$251,\"P\")","v":3259},{"$f":"IFERROR(SUMPRODUCT((Input!B$204:B$251=\"P\")*Input!C$204:C$251*Input!AL$204:AL$251)/R18,0)","v":53.26219699294262},{"$f":"SUMIF(Input!$B$204:$B$251,$AA$2,Input!D$204:D$251)","v":49},{"$f":"SUMIF(Input!$B$204:$B$251,$AA$2,Input!E$204:E$251)","v":3108},{"$f":"SUMIF(Input!$B$204:$B$251,$AA$2,Input!F$204:F$251)","v":31},{"$f":"SUMIF(Input!$B$204:$B$251,$AA$2,Input!G$204:G$251)","v":22},{"$f":"SUMIF(Input!$B$204:$B$251,$AA$2,Input!H$204:H$251)","v":72},{"$f":"SUMIF(Input!$B$204:$B$251,$AA$2,Input!I$204:I$251)","v":4},{"$f":"SUMIF(Input!$B$204:$B$251,$AA$2,Input!J$204:J$251)","v":2},{"$f":"SUMIF(Input!$B$204:$B$251,$AA$2,Input!K$204:K$251)","v":1},{"$f":"SUMIF(Input!$B$204:$B$251,$AA$2,Input!L$204:L$251)","v":0},{"$f":"SUMIF(Input!$B$204:$B$251,$AA$2,Input!M$204:M$251)","v":0},{"$f":"SUMIF(Input!$B$204:$B$251,$AA$2,Input!N$204:N$251)","v":0},{"$f":"SUMIF(Input!$B$204:$B$251,$AA$2,Input!O$204:O$251)","v":0},{"$f":"SUMIF(Input!$B$204:$B$251,$AA$2,Input!P$204:P$251)","v":0},{"$f":"SUMIF(Input!$B$204:$B$251,$AA$2,Input!Q$204:Q$251)","v":1},3290,3.0699088145896655E-2]
[null,{"$f":"IFERROR(DATEVALUE(RIGHT(Input!$A$262,LEN(Input!$A$262)-FIND(\",\",Input!$A$262)-1)),5)","v":"2024-11-03"},7,{"$f":"SUMIF(Input!$B$267:$B$314,$AA$2,Input!V$267:V$314)","v":0},{"$f":"SUMIF(Input!$B$267:$B$314,$AA$2,Input!W$267:W$314)","v":3},{"$f":"SUMIF(Input!$B$267:$B$314,$AA$2,Input!X$267:X$314)","v":28},{"$f":"SUMIF(Input!$B$267:$B$314,$AA$2,Input!Y$267:Y$314)","v":373},{"$f":"SUMIF(Input!$B$267:$B$314,$AA$2,Input!Z$267:Z$314)","v":1650},{"$f":"SUMIF(Input!$B$267:$B$314,$AA$2,Input!AA$267:AA$314)","v":941},{"$f":"SUMIF(Input!$B$267:$B$314,$AA$2,Input!AB$267:AB$314)","v":50},{"$f":"SUMIF(Input!$B$267:$B$314,$AA$2,Input!AC$267:AC$314)","v":8},{"$f":"SUMIF(Input!$B$267:$B$314,$AA$2,Input!AD$267:AD$314)","v":2},{"$f":"SUMIF(Input!$B$267:$B$314,$AA$2,Input!AE$267:AE$314)","v":0},{"$f":"SUMIF(Input!$B$267:$B$314,$AA$2,Input!AF$267:AF$314)","v":0},{"$f":"SUMIF(Input!$B$267:$B$314,$AA$2,Input!AG$267:AG$314)","v":0},{"$f":"SUMPRODUCT((Input!$B$267:$B$314=$AA$2)*Input!AH$267:AK$314)","v":2},3057,{"$f":"SUMIFS(Input!C$267:C$314,Input!AL$267:AL$314,\">0\",Input!B$267:B$314,\"P\")","v":3034},{"$f":"IFERROR(SUMPRODUCT((Input!B$267:B$314=\"P\")*Input!C$267:C$314*Input!AL$267:AL$314)/R19,0)","v":53.096242584047459},{"$f":"SUMIF(Input!$B$267:$B$314,$AA$2,Input!D$267:D$314)","v":41},{"$f":"SUMIF(Input!$B$267:$B$314,$AA$2,Input!E$267:E$314)","v":2898},{"$f":"SUMIF(Input!$B$267:$B$314,$AA$2,Input!F$267:F$314)","v":33},{"$f":"SUMIF(Input!$B$267:$B$314,$AA$2,Input!G$267:G$314)","v":16},{"$f":"SUMIF(Input!$B$267:$B$314,$AA$2,Input!H$267:H$314)","v":58},{"$f":"SUMIF(Input!$B$267:$B$314,$AA$2,Input!I$267:I$314)","v":6},{"$f":"SUMIF(Input!$B$267:$B$314,$AA$2,Input!J$267:J$314)","v":3},{"$f":"SUMIF(Input!$B$267:$B$314,$AA$2,Input!K$267:K$314)","v":1},{"$f":"SUMIF(Input!$B$267:$B$314,$AA$2,Input!L$267:L$314)","v":0},{"$f":"SUMIF(Input!$B$267:$B$314,$AA$2,Input!M$267:M$314)","v":0},{"$f":"SUMIF(Input!$B$267:$B$314,$AA$2,Input!N$267:N$314)","v":0},{"$f":"SUMIF(Input!$B$267:$B$314,$AA$2,Input!O$267:O$314)","v":0},{"$f":"SUMIF(Input!$B$267:$B$314,$AA$2,Input!P$267:P$314)","v":0},{"$f":"SUMIF(Input!$B$267:$B$314,$AA$2,Input!Q$267:Q$314)","v":1},3057,2.747791952894995E-2]
[null,{"$f":"IFERROR(DATEVALUE(RIGHT(Input!$A$325,LEN(Input!$A$325)-FIND(\",\",Input!$A$325)-1)),6)","v":"2024-11-04"},1,{"$f":"SUMIF(Input!$B$330:$B$377,$AA$2,Input!V$330:V$377)","v":0},{"$f":"SUMIF(Input!$B$330:$B$377,$AA$2,Input!W$330:W$377)","v":4},{"$f":"SUMIF(Input!$B$330:$B$377,$AA$2,Input!X$330:X$377)","v":50},{"$f":"SUMIF(Input!$B$330:$B$377,$AA$2,Input!Y$330:Y$377)","v":423},{"$f":"SUMIF(Input!$B$330:$B$377,$AA$2,Input!Z$330:Z$377)","v":2525},{"$f":"SUMIF(Input!$B$330:$B$377,$AA$2,Input!AA$330:AA$377)","v":1317},{"$f":"SUMIF(Input!$B$330:$B$377,$AA$2,Input!AB$330:AB$377)","v":47},{"$f":"SUMIF(Input!$B$330:$B$377,$AA$2,Input!AC$330:AC$377)","v":6},{"$f":"SUMIF(Input!$B$330:$B$377,$AA$2,Input!AD$330:AD$377)","v":4},{"$f":"SUMIF(Input!$B$330:$B$377,$AA$2,Input!AE$330:AE$377)","v":1},{"$f":"SUMIF(Input!$B$330:$B$377,$AA$2,Input!AF$330:AF$377)","v":2},{"$f":"SUMIF(Input!$B$330:$B$377,$AA$2,Input!AG$330:AG$377)","v":0},{"$f":"SUMPRODUCT((Input!$B$330:$B$377=$AA$2)*Input!AH$330:AK$377)","v":0},4379,{"$f":"SUMIFS(Input!C$330:C$377,Input!AL$330:AL$377,\">0\",Input!B$330:B$377,\"P\")","v":4369},{"$f":"IFERROR(SUMPRODUCT((Input!B$330:B$377=\"P\")*Input!C$330:C$377*Input!AL$330:AL$377)/R20,0)","v":52.919981689173731},{"$f":"SUMIF(Input!$B$330:$B$377,$AA$2,Input!D$330:D$377)","v":41},{"$f":"SUMIF(Input!$B$330:$B$377,$AA$2,Input!E$330:E$377)","v":4150},{"$f":"SUMIF(Input!$B$330:$B$377,$AA$2,Input!F$330:F$377)","v":36},{"$f":"SUMIF(Input!$B$330:$B$377,$AA$2,Input!G$330:G$377)","v":50},{"$f":"SUMIF(Input!$B$330:$B$377,$AA$2,Input!H$330:H$377)","v":86},{"$f":"SUMIF(Input!$B$330:$B$377,$AA$2,Input!I$330:I$377)","v":4},{"$f":"SUMIF(Input!$B$330:$B$377,$AA$2,Input!J$330:J$377)","v":8},{"$f":"SUMIF(Input!$B$330:$B$377,$AA$2,Input!K$330:K$377)","v":1},{"$f":"SUMIF(Input!$B$330:$B$377,$AA$2,Input!L$330:L$377)","v":1},{"$f":"SUMIF(Input!$B$330:$B$377,$AA$2,Input!M$330:M$377)","v":0},{"$f":"SUMIF(Input!$B$330:$B$377,$AA$2,Input!N$330:N$377)","v":0},{"$f":"SUMIF(Input!$B$330:$B$377,$AA$2,Input!O$330:O$377)","v":0},{"$f":"SUMIF(Input!$B$330:$B$377,$AA$2,Input!P$330:P$377)","v":0},{"$f":"SUMIF(Input!$B$330:$B$377,$AA$2,Input!Q$330:Q$377)","v":2},4379,3.4254395980817538E-2]
[null,{"$f":"IFERROR(DATEVALUE(RIGHT(Input!$A$388,LEN(Input!$A$388)-FIND(\",\",Input!$A$388)-1)),7)","v":"2024-11-05"},2,{"$f":"SUMIF(Input!$B$393:$B$440,$AA$2,Input!V$393:V$440)","v":0},{"$f":"SUMIF(Input!$B$393:$B$440,$AA$2,Input!W$393:W$440)","v":7},{"$f":"SUMIF(Input!$B$393:$B$440,$AA$2,Input!X$393:X$440)","v":53},{"$f":"SUMIF(Input!$B$393:$B$440,$AA$2,Input!Y$393:Y$440)","v":472},{"$f":"SUMIF(Input!$B$393:$B$440,$AA$2,Input!Z$393:Z$440)","v":2459},{"$f":"SUMIF(Input!$B$393:$B$440,$AA$2,Input!AA$393:AA$440)","v":1330},{"$f":"SUMIF(Input!$B$393:$B$440,$AA$2,Input!AB$393:AB$440)","v":55},{"$f":"SUMIF(Input!$B$393:$B$440,$AA$2,Input!AC$393:AC$440)","v":7},{"$f":"SUMIF(Input!$B$393:$B$440,$AA$2,Input!AD$393:AD$440)","v":4},{"$f":"SUMIF(Input!$B$393:$B$440,$AA$2,Input!AE$393:AE$440)","v":1},{"$f":"SUMIF(Input!$B$393:$B$440,$AA$2,Input!AF$393:AF$440)","v":0},{"$f":"SUMIF(Input!$B$393:$B$440,$AA$2,Input!AG$393:AG$440)","v":1},{"$f":"SUMPRODUCT((Input!$B$393:$B$440=$AA$2)*Input!AH$393:AK$440)","v":0},4389,{"$f":"SUMIFS(Input!C$393:C$440,Input!AL$393:AL$440,\">0\",Input!B$393:B$440,\"P\")","v":4362},{"$f":"IFERROR(SUMPRODUCT((Input!B$393:B$440=\"P\")*Input!C$393:C$440*Input!AL$393:AL$440)/R21,0)","v":52.740761118752872},{"$f":"SUMIF(Input!$B$393:$B$440,$AA$2,Input!D$393:D$440)","v":51},{"$f":"SUMIF(Input!$B$393:$B$440,$AA$2,Input!E$393:E$440)","v":4192},{"$f":"SUMIF(Input!$B$393:$B$440,$AA$2,Input!F$393:F$440)","v":26},{"$f":"SUMIF(Input!$B$393:$B$440,$AA$2,Input!G$393:G$440)","v":51},{"$f":"SUMIF(Input!$B$393:$B$440,$AA$2,Input!H$393:H$440)","v":59},{"$f":"SUMIF(Input!$B$393:$B$440,$AA$2,Input!I$393:I$440)","v":0},{"$f":"SUMIF(Input!$B$393:$B$440,$AA$2,Input!J$393:J$440)","v":2},{"$f":"SUMIF(Input!$B$393:$B$440,$AA$2,Input!K$393:K$440)","v":3},{"$f":"SUMIF(Input!$B$393:$B$440,$AA$2,Input!L$393:L$440)","v":2},{"$f":"SUMIF(Input!$B$393:$B$440,$AA$2,Input!M$393:M$440)","v":1},{"$f":"SUMIF(Input!$B$393:$B$440,$AA$2,Input!N$393:N$440)","v":0},{"$f":"SUMIF(Input!$B$393:$B$440,$AA$2,Input!O$393:O$440)","v":0},{"$f":"SUMIF(Input!$B$393:$B$440,$AA$2,Input!P$393:P$440)","v":1},{"$f":"SUMIF(Input!$B$393:$B$440,$AA$2,Input!Q$393:Q$440)","v":1},4389,2.7113237639553429E-2]
[null,"Total",null,{"$f":"SUM(D15:D21)","v":0},{"$f":"SUM(E15:E21)","v":49},335,3034,16188,8616,408,52,16,6,3,2,3,28712,28546,{"$f":"IFERROR(SUMPRODUCT(R15:R21,S15:S21)/R22,0)","v":52.893543753941003},{"$f":"SUM(T15:T21)","v":287},27238,210,274,612,26,31,14,6,2,0,0,1,11,28712,3.3644469211479518E-2]
[]
[null,{"$f":"IF(Input2!A1=\"\",\"Direction 2: Towards \"&Input!B5,\"Direction 1/Lane 2 : Towards \"&Input!B6)","v":"Direction 2: Towards DUNCANSBY RD"}]
[null,null,null,"Summary of Speed Classification",null,null,null,null,null,null,null,null,null,null,null,null,null,null,null,"Summary of Vehicle Classification"]
[null,"Date",null,"<10","10-20","20-30","30-40","40-50","50-60","60-70","70-80","80-90","90-100","100-110","110-120","121+","Daily","85th Percentile",null,"CL1","CL2","CL3","CL4","CL5","CL6","CL7","CL8","CL9","CL10","CL11","CL12","CL13","CL14","Daily","%HCV"]
[null,{"$f":"IFERROR(TEXT(B28,\"MMMM\"),0)","v":"October"},"Day",null,null,null,null,null,null,null,null,null,null,null,null,null,"Total","Total","Speed",null,null,null,null,null,null,null,null,null,null,null,null,null,null,"Total"]
[null,{"$f":"IFERROR(DATEVALUE(RIGHT(Input!$A$10,LEN(Input!$A$10)-FIND(\",\",Input!$A$10)-1)),1)","v":"2024-10-30"},{"$f":"IFERROR(WEEKDAY(B28,2),0)","v":3},{"$f":"SUMIF(Input!$B$15:$B$62,$AB$2,Input!V$15:V$62)","v":0},{"$f":"SUMIF(Input!$B$15:$B$62,$AB$2,Input!W$15:W$62)","v":8},{"$f":"SUMIF(Input!$B$15:$B$62,$AB$2,Input!X$15:X$62)","v":220},{"$f":"SUMIF(Input!$B$15:$B$62,$AB$2,Input!Y$15:Y$62)","v":807},{"$f":"SUMIF(Input!$B$15:$B$62,$AB$2,Input!Z$15:Z$62)","v":4288},{"$f":"SUMIF(Input!$B$15:$B$62,$AB$2,Input!AA$15:AA$62)","v":272},{"$f":"SUMIF(Input!$B$15:$B$62,$AB$2,Input!AB$15:AB$62)","v":4},{"$f":"SUMIF(Input!$B$15:$B$62,$AB$2,Input!AC$15:AC$62)","v":0},{"$f":"SUMIF(Input!$B$15:$B$62,$AB$2,Input!AD$15:AD$62)","v":0},{"$f":"SUMIF(Input!$B$15:$B$62,$AB$2,Input!AE$15:AE$62)","v":0},{"$f":"SUMIF(Input!$B$15:$B$62,$AB$2,Input!AF$15:AF$62)","v":0},{"$f":"SUMIF(Input!$B$15:$B$62,$AB$2,Input!AG$15:AG$62)","v":0},{"$f":"SUMPRODUCT((Input!$B$15:$B$62=$AB$2)*Input!AH$15:AK$62)","v":0},{"$f":"SUM(D28:P28)","v":5599},{"$f":"SUMIFS(Input!C$15:C$62,Input!AL$15:AL$62,\">0\",Input!B$15:B$62,\"S\")","v":5592},{"$f":"IFERROR(SUMPRODUCT((Input!B$15:B$62=\"S\")*Input!C$15:C$62*Input!AL$15:AL$62)/R28,0)","v":47.614967811158806},{"$f":"SUMIF(Input!$B$15:$B$62,$AB$2,Input!D$15:D$62)","v":26},{"$f":"SUMIF(Input!$B$15:$B$62,$AB$2,Input!E$15:E$62)","v":5445},{"$f":"SUMIF(Input!$B$15:$B$62,$AB$2,Input!F$15:F$62)","v":31},{"$f":"SUMIF(Input!$B$15:$B$62,$AB$2,Input!G$15:G$62)","v":65},{"$f":"SUMIF(Input!$B$15:$B$62,$AB$2,Input!H$15:H$62)","v":17},{"$f":"SUMIF(Input!$B$15:$B$62,$AB$2,Input!I$15:I$62)","v":4},{"$f":"SUMIF(Input!$B$15:$B$62,$AB$2,Input!J$15:J$62)","v":9},{"$f":"SUMIF(Input!$B$15:$B$62,$AB$2,Input!K$15:K$62)","v":1},{"$f":"SUMIF(Input!$B$15:$B$62,$AB$2,Input!L$15:L$62)","v":0},{"$f":"SUMIF(Input!$B$15:$B$62,$AB$2,Input!M$15:M$62)","v":0},{"$f":"SUMIF(Input!$B$15:$B$62,$AB$2,Input!N$15:N$62)","v":0},{"$f":"SUMIF(Input!$B$15:$B$62,$AB$2,Input!O$15:O$62)","v":0},{"$f":"SUMIF(Input!$B$15:$B$62,$AB$2,Input!P$15:P$62)","v":0},{"$f":"SUMIF(Input!$B$15:$B$62,$AB$2,Input!Q$15:Q$62)","v":1},{"$f":"SUM(T28:AG28)","v":5599},{"$f":"IFERROR(SUM(W28:AF28)/AH28,0)","v":1.7145918914091802E-2}]
[null,{"$f":"IFERROR(DATEVALUE(RIGHT(Input!$A$73,LEN(Input!$A$73)-FIND(\",\",Input!$A$73)-1)),2)","v":"2024-10-31"},{"$f":"IFERROR(WEEKDAY(B29,2),0)","v":4},{"$f":"SUMIF(Input!$B$78:$B$125,$AB$2,Input!V$78:V$125)","v":0},{"$f":"SUMIF(Input!$B$78:$B$125,$AB$2,Input!W$78:W$125)","v":13},{"$f":"SUMIF(Input!$B$78:$B$125,$AB$2,Input!X$78:X$125)","v":206},{"$f":"SUMIF(Input!$B$78:$B$125,$AB$2,Input!Y$78:Y$125)","v":843},{"$f":"SUMIF(Input!$B$78:$B$125,$AB$2,Input!Z$78:Z$125)","v":4213},{"$f":"SUMIF(Input!$B$78:$B$125,$AB$2,Input!AA$78:AA$125)","v":325},{"$f":"SUMIF(Input!$B$78:$B$125,$AB$2,Input!AB$78:AB$125)","v":4},{"$f":"SUMIF(Input!$B$78:$B$125,$AB$2,Input!AC$78:AC$125)","v":0},{"$f":"SUMIF(Input!$B$78:$B$125,$AB$2,Input!AD$78:AD$125)","v":0},{"$f":"SUMIF(Input!$B$78:$B$125,$AB$2,Input!AE$78:AE$125)","v":0},{"$f":"SUMIF(Input!$B$78:$B$125,$AB$2,Input!AF$78:AF$125)","v":0},{"$f":"SUMIF(Input!$B$78:$B$125,$AB$2,Input!AG$78:AG$125)","v":0},{"$f":"SUMPRODUCT((Input!$B$78:$B$125=$AB$2)*Input!AH$78:AK$125)","v":0},5604,{"$f":"SUMIFS(Input!C$78:C$125,Input!AL$78:AL$125,\">0\",Input!B$78:B$125,\"S\")","v":5580},{"$f":"IFERROR(SUMPRODUCT((Input!B$78:B$125=\"S\")*Input!C$78:C$125*Input!AL$78:AL$125)/R29,0)","v":47.815250896057357},{"$f":"SUMIF(Input!$B$78:$B$125,$AB$2,Input!D$78:D$125)","v":34},{"$f":"SUMIF(Input!$B$78:$B$125,$AB$2,Input!E$78:E$125)","v":5427},{"$f":"SUMIF(Input!$B$78:$B$125,$AB$2,Input!F$78:F$125)","v":46},{"$f":"SUMIF(Input!$B$78:$B$125,$AB$2,Input!G$78:G$125)","v":66},{"$f":"SUMIF(Input!$B$78:$B$125,$AB$2,Input!H$78:H$125)","v":18},{"$f":"SUMIF(Input!$B$78:$B$125,$AB$2,Input!I$78:I$125)","v":6},{"$f":"SUMIF(Input!$B$78:$B$125,$AB$2,Input!J$78:J$125)","v":6},{"$f":"SUMIF(Input!$B$78:$B$125,$AB$2,Input!K$78:K$125)","v":1},{"$f":"SUMIF(Input!$B$78:$B$125,$AB$2,Input!L$78:L$125)","v":0},{"$f":"SUMIF(Input!$B$78:$B$125,$AB$2,Input!M$78:M$125)","v":0},{"$f":"SUMIF(Input!$B$78:$B$125,$AB$2,Input!N$78:N$125)","v":0},{"$f":"SUMIF(Input!$B$78:$B$125,$AB$2,Input!O$78:O$125)","v":0},{"$f":"SUMIF(Input!$B$78:$B$125,$AB$2,Input!P$78:P$125)","v":0},{"$f":"SUMIF(Input!$B$78:$B$125,$AB$2,Input!Q$78:Q$125)","v":0},{"$f":"SUM(T29:AG29)","v":5604},1.7309064953604569E-2]
[null,{"$f":"IFERROR(DATEVALUE(RIGHT(Input!$A$136,LEN(Input!$A$136)-FIND(\",\",Input!$A$136)-1)),3)","v":"2024-11-01"},5,{"$f":"SUMIF(Input!$B$141:$B$188,$AB$2,Input!V$141:V$188)","v":0},{"$f":"SUMIF(Input!$B$141:$B$188,$AB$2,Input!W$141:W$188)","v":8},{"$f":"SUMIF(Input!$B$141:$B$188,$AB$2,Input!X$141:X$188)","v":197},{"$f":"SUMIF(Input!$B$141:$B$188,$AB$2,Input!Y$141:Y$188)","v":782},{"$f":"SUMIF(Input!$B$141:$B$188,$AB$2,Input!Z$141:Z$188)","v":4305},{"$f":"SUMIF(Input!$B$141:$B$188,$AB$2,Input!AA$141:AA$188)","v":288},{"$f":"SUMIF(Input!$B$141:$B$188,$AB$2,Input!AB$141:AB$188)","v":2},{"$f":"SUMIF(Input!$B$141:$B$188,$AB$2,Input!AC$141:AC$188)","v":0},{"$f":"SUMIF(Input!$B$141:$B$188,$AB$2,Input!AD$141:AD$188)","v":0},{"$f":"SUMIF(Input!$B$141:$B$188,$AB$2,Input!AE$141:AE$188)","v":0},{"$f":"SUMIF(Input!$B$141:$B$188,$AB$2,Input!AF$141:AF$188)","v":0},{"$f":"SUMIF(Input!$B$141:$B$188,$AB$2,Input!AG$141:AG$188)","v":0},{"$f":"SUMPRODUCT((Input!$B$141:$B$188=$AB$2)*Input!AH$141:AK$188)","v":0},5582,{"$f":"SUMIFS(Input!C$144:C$188,Input!AL$144:AL$188,\">0\",Input!B$144:B$188,\"S\")","v":5561},{"$f":"IFERROR(SUMPRODUCT((Input!B$141:B$188=\"S\")*Input!C$141:C$188*Input!AL$141:AL$188)/R30,0)","v":47.759593598273689},{"$f":"SUMIF(Input!$B$141:$B$188,$AB$2,Input!D$141:D$188)","v":45},{"$f":"SUMIF(Input!$B$141:$B$188,$AB$2,Input!E$141:E$188)","v":5372},{"$f":"SUMIF(Input!$B$141:$B$188,$AB$2,Input!F$141:F$188)","v":58},{"$f":"SUMIF(Input!$B$141:$B$188,$AB$2,Input!G$141:G$188)","v":68},{"$f":"SUMIF(Input!$B$141:$B$188,$AB$2,Input!H$141:H$188)","v":23},{"$f":"SUMIF(Input!$B$141:$B$188,$AB$2,Input!I$141:I$188)","v":6},{"$f":"SUMIF(Input!$B$141:$B$188,$AB$2,Input!J$141:J$188)","v":7},{"$f":"SUMIF(Input!$B$141:$B$188,$AB$2,Input!K$141:K$188)","v":1},{"$f":"SUMIF(Input!$B$141:$B$188,$AB$2,Input!L$141:L$188)","v":0},{"$f":"SUMIF(Input!$B$141:$B$188,$AB$2,Input!M$141:M$188)","v":0},{"$f":"SUMIF(Input!$B$141:$B$188,$AB$2,Input!N$141:N$188)","v":0},{"$f":"SUMIF(Input!$B$141:$B$188,$AB$2,Input!O$141:O$188)","v":0},{"$f":"SUMIF(Input!$B$141:$B$188,$AB$2,Input!P$141:P$188)","v":1},{"$f":"SUMIF(Input!$B$141:$B$188,$AB$2,Input!Q$141:Q$188)","v":1},5582,1.8989609458975279E-2]
[null,{"$f":"IFERROR(DATEVALUE(RIGHT(Input!$A$199,LEN(Input!$A$199)-FIND(\",\",Input!$A$199)-1)),4)","v":"2024-11-02"},6,{"$f":"SUMIF(Input!$B$204:$B$251,$AB$2,Input!V$204:V$251)","v":0},{"$f":"SUMIF(Input!$B$204:$B$251,$AB$2,Input!W$204:W$251)","v":7},{"$f":"SUMIF(Input!$B$204:$B$251,$AB$2,Input!X$204:X$251)","v":200},{"$f":"SUMIF(Input!$B$204:$B$251,$AB$2,Input!Y$204:Y$251)","v":615},{"$f":"SUMIF(Input!$B$204:$B$251,$AB$2,Input!Z$204:Z$251)","v":3170},{"$f":"SUMIF(Input!$B$204:$B$251,$AB$2,Input!AA$204:AA$251)","v":219},{"$f":"SUMIF(Input!$B$204:$B$251,$AB$2,Input!AB$204:AB$251)","v":3},{"$f":"SUMIF(Input!$B$204:$B$251,$AB$2,Input!AC$204:AC$251)","v":1},{"$f":"SUMIF(Input!$B$204:$B$251,$AB$2,Input!AD$204:AD$251)","v":0},{"$f":"SUMIF(Input!$B$204:$B$251,$AB$2,Input!AE$204:AE$251)","v":0},{"$f":"SUMIF(Input!$B$204:$B$251,$AB$2,Input!AF$204:AF$251)","v":0},{"$f":"SUMIF(Input!$B$204:$B$251,$AB$2,Input!AG$204:AG$251)","v":0},{"$f":"SUMPRODUCT((Input!$B$204:$B$251=$AB$2)*Input!AH$204:AK$251)","v":0},4215,{"$f":"SUMIFS(Input!C$204:C$251,Input!AL$204:AL$251,\">0\",Input!B$204:B$251,\"S\")","v":4202},{"$f":"IFERROR(SUMPRODUCT((Input!B$204:B$251=\"S\")*Input!C$204:C$251*Input!AL$204:AL$251)/R31,0)","v":47.831913374583536},{"$f":"SUMIF(Input!$B$204:$B$251,$AB$2,Input!D$204:D$251)","v":37},{"$f":"SUMIF(Input!$B$204:$B$251,$AB$2,Input!E$204:E$251)","v":4056},{"$f":"SUMIF(Input!$B$204:$B$251,$AB$2,Input!F$204:F$251)","v":55},{"$f":"SUMIF(Input!$B$204:$B$251,$AB$2,Input!G$204:G$251)","v":45},{"$f":"SUMIF(Input!$B$204:$B$251,$AB$2,Input!H$204:H$251)","v":7},{"$f":"SUMIF(Input!$B$204:$B$251,$AB$2,Input!I$204:I$251)","v":4},{"$f":"SUMIF(Input!$B$204:$B$251,$AB$2,Input!J$204:J$251)","v":8},{"$f":"SUMIF(Input!$B$204:$B$251,$AB$2,Input!K$204:K$251)","v":0},{"$f":"SUMIF(Input!$B$204:$B$251,$AB$2,Input!L$204:L$251)","v":0},{"$f":"SUMIF(Input!$B$204:$B$251,$AB$2,Input!M$204:M$251)","v":0},{"$f":"SUMIF(Input!$B$204:$B$251,$AB$2,Input!N$204:N$251)","v":0},{"$f":"SUMIF(Input!$B$204:$B$251,$AB$2,Input!O$204:O$251)","v":0},{"$f":"SUMIF(Input!$B$204:$B$251,$AB$2,Input!P$204:P$251)","v":0},{"$f":"SUMIF(Input!$B$204:$B$251,$AB$2,Input!Q$204:Q$251)","v":3},4215,1.5183867141162514E-2]
[null,{"$f":"IFERROR(DATEVALUE(RIGHT(Input!$A$262,LEN(Input!$A$262)-FIND(\",\",Input!$A$262)-1)),5)","v":"2024-11-03"},7,{"$f":"SUMIF(Input!$B$267:$B$314,$AB$2,Input!V$267:V$314)","v":0},{"$f":"SUMIF(Input!$B$267:$B$314,$AB$2,Input!W$267:W$314)","v":6},{"$f":"SUMIF(Input!$B$267:$B$314,$AB$2,Input!X$267:X$314)","v":180},{"$f":"SUMIF(Input!$B$267:$B$314,$AB$2,Input!Y$267:Y$314)","v":541},{"$f":"SUMIF(Input!$B$267:$B$314,$AB$2,Input!Z$267:Z$314)","v":2718},{"$f":"SUMIF(Input!$B$267:$B$314,$AB$2,Input!AA$267:AA$314)","v":199},{"$f":"SUMIF(Input!$B$267:$B$314,$AB$2,Input!AB$267:AB$314)","v":5},{"$f":"SUMIF(Input!$B$267:$B$314,$AB$2,Input!AC$267:AC$314)","v":1},{"$f":"SUMIF(Input!$B$267:$B$314,$AB$2,Input!AD$267:AD$314)","v":0},{"$f":"SUMIF(Input!$B$267:$B$314,$AB$2,Input!AE$267:AE$314)","v":0},{"$f":"SUMIF(Input!$B$267:$B$314,$AB$2,Input!AF$267:AF$314)","v":0},{"$f":"SUMIF(Input!$B$267:$B$314,$AB$2,Input!AG$267:AG$314)","v":0},{"$f":"SUMPRODUCT((Input!$B$267:$B$314=$AB$2)*Input!AH$267:AK$314)","v":1},3651,{"$f":"SUMIFS(Input!C$267:C$314,Input!AL$267:AL$314,\">0\",Input!B$267:B$314,\"S\")","v":3627},{"$f":"IFERROR(SUMPRODUCT((Input!B$267:B$314=\"S\")*Input!C$267:C$314*Input!AL$267:AL$314)/R32,0)","v":47.994265232974911},{"$f":"SUMIF(Input!$B$267:$B$314,$AB$2,Input!D$267:D$314)","v":46},{"$f":"SUMIF(Input!$B$267:$B$314,$AB$2,Input!E$267:E$314)","v":3535},{"$f":"SUMIF(Input!$B$267:$B$314,$AB$2,Input!F$267:F$314)","v":27},{"$f":"SUMIF(Input!$B$267:$B$314,$AB$2,Input!G$267:G$314)","v":34},{"$f":"SUMIF(Input!$B$267:$B$314,$AB$2,Input!H$267:H$314)","v":3},{"$f":"SUMIF(Input!$B$267:$B$314,$AB$2,Input!I$267:I$314)","v":2},{"$f":"SUMIF(Input!$B$267:$B$314,$AB$2,Input!J$267:J$314)","v":3},{"$f":"SUMIF(Input!$B$267:$B$314,$AB$2,Input!K$267:K$314)","v":1},{"$f":"SUMIF(Input!$B$267:$B$314,$AB$2,Input!L$267:L$314)","v":0},{"$f":"SUMIF(Input!$B$267:$B$314,$AB$2,Input!M$267:M$314)","v":0},{"$f":"SUMIF(Input!$B$267:$B$314,$AB$2,Input!N$267:N$314)","v":0},{"$f":"SUMIF(Input!$B$267:$B$314,$AB$2,Input!O$267:O$314)","v":0},{"$f":"SUMIF(Input!$B$267:$B$314,$AB$2,Input!P$267:P$314)","v":0},{"$f":"SUMIF(Input!$B$267:$B$314,$AB$2,Input!Q$267:Q$314)","v":0},3651,1.1777595179402904E-2]
[null,{"$f":"IFERROR(DATEVALUE(RIGHT(Input!$A$325,LEN(Input!$A$325)-FIND(\",\",Input!$A$325)-1)),6)","v":"2024-11-04"},1,{"$f":"SUMIF(Input!$B$330:$B$377,$AB$2,Input!V$330:V$377)","v":0},{"$f":"SUMIF(Input!$B$330:$B$377,$AB$2,Input!W$330:W$377)","v":11},{"$f":"SUMIF(Input!$B$330:$B$377,$AB$2,Input!X$330:X$377)","v":205},{"$f":"SUMIF(Input!$B$330:$B$377,$AB$2,Input!Y$330:Y$377)","v":823},{"$f":"SUMIF(Input!$B$330:$B$377,$AB$2,Input!Z$330:Z$377)","v":4010},{"$f":"SUMIF(Input!$B$330:$B$377,$AB$2,Input!AA$330:AA$377)","v":262},{"$f":"SUMIF(Input!$B$330:$B$377,$AB$2,Input!AB$330:AB$377)","v":4},{"$f":"SUMIF(Input!$B$330:$B$377,$AB$2,Input!AC$330:AC$377)","v":0},{"$f":"SUMIF(Input!$B$330:$B$377,$AB$2,Input!AD$330:AD$377)","v":0},{"$f":"SUMIF(Input!$B$330:$B$377,$AB$2,Input!AE$330:AE$377)","v":0},{"$f":"SUMIF(Input!$B$330:$B$377,$AB$2,Input!AF$330:AF$377)","v":0},{"$f":"SUMIF(Input!$B$330:$B$377,$AB$2,Input!AG$330:AG$377)","v":0},{"$f":"SUMPRODUCT((Input!$B$330:$B$377=$AB$2)*Input!AH$330:AK$377)","v":0},5315,{"$f":"SUMIFS(Input!C$330:C$377,Input!AL$330:AL$377,\">0\",Input!B$330:B$377,\"S\")","v":5295},{"$f":"IFERROR(SUMPRODUCT((Input!B$330:B$377=\"S\")*Input!C$330:C$377*Input!AL$330:AL$377)/R33,0)","v":47.465344664778101},{"$f":"SUMIF(Input!$B$330:$B$377,$AB$2,Input!D$330:D$377)","v":31},{"$f":"SUMIF(Input!$B$330:$B$377,$AB$2,Input!E$330:E$377)","v":5119},{"$f":"SUMIF(Input!$B$330:$B$377,$AB$2,Input!F$330:F$377)","v":64},{"$f":"SUMIF(Input!$B$330:$B$377,$AB$2,Input!G$330:G$377)","v":59},{"$f":"SUMIF(Input!$B$330:$B$377,$AB$2,Input!H$330:H$377)","v":26},{"$f":"SUMIF(Input!$B$330:$B$377,$AB$2,Input!I$330:I$377)","v":5},{"$f":"SUMIF(Input!$B$330:$B$377,$AB$2,Input!J$330:J$377)","v":5},{"$f":"SUMIF(Input!$B$330:$B$377,$AB$2,Input!K$330:K$377)","v":1},{"$f":"SUMIF(Input!$B$330:$B$377,$AB$2,Input!L$330:L$377)","v":0},{"$f":"SUMIF(Input!$B$330:$B$377,$AB$2,Input!M$330:M$377)","v":0},{"$f":"SUMIF(Input!$B$330:$B$377,$AB$2,Input!N$330:N$377)","v":0},{"$f":"SUMIF(Input!$B$330:$B$377,$AB$2,Input!O$330:O$377)","v":0},{"$f":"SUMIF(Input!$B$330:$B$377,$AB$2,Input!P$330:P$377)","v":0},{"$f":"SUMIF(Input!$B$330:$B$377,$AB$2,Input!Q$330:Q$377)","v":5},5315,1.8062088428974599E-2]
[null,{"$f":"IFERROR(DATEVALUE(RIGHT(Input!$A$388,LEN(Input!$A$388)-FIND(\",\",Input!$A$388)-1)),7)","v":"2024-11-05"},2,{"$f":"SUMIF(Input!$B$393:$B$440,$AB$2,Input!V$393:V$440)","v":0},{"$f":"SUMIF(Input!$B$393:$B$440,$AB$2,Input!W$393:W$440)","v":3},{"$f":"SUMIF(Input!$B$393:$B$440,$AB$2,Input!X$393:X$440)","v":200},{"$f":"SUMIF(Input!$B$393:$B$440,$AB$2,Input!Y$393:Y$440)","v":755},{"$f":"SUMIF(Input!$B$393:$B$440,$AB$2,Input!Z$393:Z$440)","v":4136},{"$f":"SUMIF(Input!$B$393:$B$440,$AB$2,Input!AA$393:AA$440)","v":253},{"$f":"SUMIF(Input!$B$393:$B$440,$AB$2,Input!AB$393:AB$440)","v":3},{"$f":"SUMIF(Input!$B$393:$B$440,$AB$2,Input!AC$393:AC$440)","v":0},{"$f":"SUMIF(Input!$B$393:$B$440,$AB$2,Input!AD$393:AD$440)","v":0},{"$f":"SUMIF(Input!$B$393:$B$440,$AB$2,Input!AE$393:AE$440)","v":0},{"$f":"SUMIF(Input!$B$393:$B$440,$AB$2,Input!AF$393:AF$440)","v":0},{"$f":"SUMIF(Input!$B$393:$B$440,$AB$2,Input!AG$393:AG$440)","v":0},{"$f":"SUMPRODUCT((Input!$B$393:$B$440=$AB$2)*Input!AH$393:AK$440)","v":0},5350,{"$f":"SUMIFS(Input!C$393:C$440,Input!AL$393:AL$440,\">0\",Input!B$393:B$440,\"S\")","v":5327},{"$f":"IFERROR(SUMPRODUCT((Input!B$393:B$440=\"S\")*Input!C$393:C$440*Input!AL$393:AL$440)/R34,0)","v":47.341636943870853},{"$f":"SUMIF(Input!$B$393:$B$440,$AB$2,Input!D$393:D$440)","v":45},{"$f":"SUMIF(Input!$B$393:$B$440,$AB$2,Input!E$393:E$440)","v":5158},{"$f":"SUMIF(Input!$B$393:$B$440,$AB$2,Input!F$393:F$440)","v":36},{"$f":"SUMIF(Input!$B$393:$B$440,$AB$2,Input!G$393:G$440)","v":65},{"$f":"SUMIF(Input!$B$393:$B$440,$AB$2,Input!H$393:H$440)","v":32},{"$f":"SUMIF(Input!$B$393:$B$440,$AB$2,Input!I$393:I$440)","v":4},{"$f":"SUMIF(Input!$B$393:$B$440,$AB$2,Input!J$393:J$440)","v":6},{"$f":"SUMIF(Input!$B$393:$B$440,$AB$2,Input!K$393:K$440)","v":0},{"$f":"SUMIF(Input!$B$393:$B$440,$AB$2,Input!L$393:L$440)","v":0},{"$f":"SUMIF(Input!$B$393:$B$440,$AB$2,Input!M$393:M$440)","v":0},{"$f":"SUMIF(Input!$B$393:$B$440,$AB$2,Input!N$393:N$440)","v":0},{"$f":"SUMIF(Input!$B$393:$B$440,$AB$2,Input!O$393:O$440)","v":1},{"$f":"SUMIF(Input!$B$393:$B$440,$AB$2,Input!P$393:P$440)","v":0},{"$f":"SUMIF(Input!$B$393:$B$440,$AB$2,Input!Q$393:Q$440)","v":3},5350,2.0186915887850466E-2]
[null,"Total",null,{"$f":"SUM(D28:D34)","v":0},{"$f":"SUM(E28:E34)","v":56},1408,5166,26840,1818,25,2,0,0,0,0,1,35316,35184,{"$f":"IFERROR(SUMPRODUCT(R28:R34,S28:S34)/R35,0)","v":47.67069974988631},{"$f":"SUM(T28:T34)","v":264},34112,317,402,126,31,44,5,0,0,0,1,1,13,35316,1.7272624306263449E-2]
[]
[null,{"$f":"IF(Input2!A1=\"\",\"Both Directions\",\"Direction 1/Both Lanes : Towards \"&Input!B6)","v":"Both Directions"}]
[null,null,null,"Summary of Speed Classification",null,null,null,null,null,null,null,null,null,null,null,null,null,null,null,"Summary of Vehicle Classification"]
[null,"Date",null,"<10","10-20","20-30","30-40","40-50","50-60","60-70","70-80","80-90","90-100","100-110","110-120","121+","Daily","85th Percentile",null,"CL1","CL2","CL3","CL4","CL5","CL6","CL7","CL8","CL9","CL10","CL11","CL12","CL13","CL14","Daily","%HCV"]
[null,{"$f":"IFERROR(TEXT(B41,\"MMMM\"),0)","v":"October"},"Day",null,null,null,null,null,null,null,null,null,null,null,null,null,"Total","Total","Speed",null,null,null,null,null,null,null,null,null,null,null,null,null,null,"Total"]
[null,{"$f":"IFERROR(DATEVALUE(RIGHT(Input!$A$10,LEN(Input!$A$10)-FIND(\",\",Input!$A$10)-1)),1)","v":"2024-10-30"},{"$f":"IFERROR(WEEKDAY(B41,2),0)","v":3},{"$f":"D15+D28","v":0},{"$f":"E15+E28","v":14},268,1284,6796,1475,65,7,0,0,0,1,1,{"$f":"SUM(D41:P41)","v":9911},{"$f":"SUMIF(Input!AL$15:AL$62,\">0\",Input!C$15:C$62)","v":9888},{"$f":"IFERROR(SUMPRODUCT(Input!C$15:C$62*Input!AL$15:AL$62)/R41,0)","v":49.775930420711987},{"$f":"T15+T28","v":47},9521,46,104,160,8,17,5,1,0,0,0,0,2,{"$f":"SUM(T41:AG41)","v":9911},{"$f":"IFERROR(SUM(W41:AF41)/AH41,0)","v":2.9764907678337203E-2}]
[null,{"$f":"IFERROR(DATEVALUE(RIGHT(Input!$A$73,LEN(Input!$A$73)-FIND(\",\",Input!$A$73)-1)),2)","v":"2024-10-31"},{"$f":"IFERROR(WEEKDAY(B42,2),0)","v":4},{"$f":"D16+D29","v":0},{"$f":"E16+E29","v":17},270,1306,6979,1705,67,6,4,2,1,0,0,10357,{"$f":"SUMIF(Input!AL$78:AL$125,\">0\",Input!C$78:C$125)","v":10309},{"$f":"IFERROR(SUMPRODUCT(Input!C$78:C$125*Input!AL$78:AL$125)/R42,0)","v":50.042836356581624},{"$f":"T16+T29","v":72},9938,90,110,119,9,11,3,1,1,0,0,0,3,{"$f":"SUM(T42:AG42)","v":10357},2.452447619967172E-2]
[null,{"$f":"IFERROR(DATEVALUE(RIGHT(Input!$A$136,LEN(Input!$A$136)-FIND(\",\",Input!$A$136)-1)),3)","v":"2024-11-01"},5,{"$f":"D17+D30","v":0},{"$f":"E17+E30","v":20},255,1225,6836,1698,73,6,1,0,0,0,0,10114,{"$f":"SUMIF(Input!AL$141:AL$188,\">0\",Input!C$141:C$188)","v":10069},{"$f":"IFERROR(SUMPRODUCT(Input!C$141:C$188*Input!AL$141:AL$188)/R43,0)","v":50.109057503227731},{"$f":"T17+T30","v":91},9675,83,120,116,11,10,3,1,0,0,0,1,3,10114,2.5904686573067034E-2]
[null,{"$f":"IFERROR(DATEVALUE(RIGHT(Input!$A$199,LEN(Input!$A$199)-FIND(\",\",Input!$A$199)-1)),4)","v":"2024-11-02"},6,{"$f":"D18+D31","v":0},{"$f":"E18+E31","v":20},234,998,4919,1254,64,13,1,2,0,0,0,7505,{"$f":"SUMIF(Input!AL$204:AL$251,\">0\",Input!C$204:C$251)","v":7461},{"$f":"IFERROR(SUMPRODUCT(Input!C$204:C$251*Input!AL$204:AL$251)/R44,0)","v":50.20388687843451},{"$f":"T18+T31","v":86},7164,86,67,79,8,10,1,0,0,0,0,0,4,7505,2.1985343104596936E-2]
[null,{"$f":"IFERROR(DATEVALUE(RIGHT(Input!$A$262,LEN(Input!$A$262)-FIND(\",\",Input!$A$262)-1)),5)","v":"2024-11-03"},7,{"$f":"D19+D32","v":0},{"$f":"E19+E32","v":9},208,914,4368,1140,55,9,2,0,0,0,3,6708,{"$f":"SUMIF(Input!AL$267:AL$314,\">0\",Input!C$267:C$314)","v":6661},{"$f":"IFERROR(SUMPRODUCT(Input!C$267:C$314*Input!AL$267:AL$314)/R45,0)","v":50.318150427863678},{"$f":"T19+T32","v":87},6433,60,50,61,8,6,2,0,0,0,0,0,1,6708,1.8932617769827072E-2]
[null,{"$f":"IFERROR(DATEVALUE(RIGHT(Input!$A$325,LEN(Input!$A$325)-FIND(\",\",Input!$A$325)-1)),6)","v":"2024-11-04"},1,{"$f":"D20+D33","v":0},{"$f":"E20+E33","v":15},255,1246,6535,1579,51,6,4,1,2,0,0,9694,{"$f":"SUMIF(Input!AL$330:AL$377,\">0\",Input!C$330:C$377)","v":9664},{"$f":"IFERROR(SUMPRODUCT(Input!C$330:C$377*Input!AL$330:AL$377)/R46,0)","v":49.931332781456959},{"$f":"T20+T33","v":72},9269,100,109,112,9,13,2,1,0,0,0,0,7,9694,2.5376521559727666E-2]
[null,{"$f":"IFERROR(DATEVALUE(RIGHT(Input!$A$388,LEN(Input!$A$388)-FIND(\",\",Input!$A$388)-1)),7)","v":"2024-11-05"},2,{"$f":"D21+D34","v":0},{"$f":"E21+E34","v":10},253,1227,6595,1583,58,7,4,1,0,1,0,9739,{"$f":"SUMIF(Input!AL$393:AL$440,\">0\",Input!C$393:C$440)","v":9689},{"$f":"IFERROR(SUMPRODUCT(Input!C$393:C$440*Input!AL$393:AL$440)/R47,0)","v":49.772329445763241},{"$f":"T21+T34","v":96},9350,62,116,91,4,8,3,2,1,0,1,1,4,9739,2.3308347879659103E-2]
[null,"Total",null,{"$f":"SUM(D41:D47)","v":0},{"$f":"SUM(E41:E47)","v":105},1743,8200,43028,10434,433,54,16,6,3,2,4,64028,63741,{"$f":"IFERROR(SUMPRODUCT(R41:R47,S41:S47)/R48,0)","v":50.001490406488756},{"$f":"SUM(T41:T47)","v":551},61350,527,676,738,57,75,19,6,2,0,1,2,24,64028,2.4614231273817705E-2]
[]
[null,{"$f":"\"Direction 2/Lane 1 : Towards \"&Input!B5","v":"Direction 2/Lane 1 : Towards DUNCANSBY RD"}]
[null,null,null,"Summary of Speed Classification",null,null,null,null,null,null,null,null,null,null,null,null,null,null,null,"Summary of Vehicle Classification"]
[null,"Date",null,"<10","10-20","20-30","30-40","40-50","50-60","60-70","70-80","80-90","90-100","100-110","110-120","121+","Daily","85th Percentile",null,"CL1","CL2","CL3","CL4","CL5","CL6","CL7","CL8","CL9","CL10","CL11","CL12","CL13","CL14","Daily","%HCV"]
[null,{"$f":"IFERROR(TEXT(B54,\"MMMM\"),0)","v":"January"},"Day",null,null,null,null,null,null,null,null,null,null,null,null,null,"Total","Total","Speed",null,null,null,null,null,null,null,null,null,null,null,null,null,null,"Total"]
[null,{"$f":"IFERROR(DATEVALUE(RIGHT(Input2!$A$10,LEN(Input2!$A$10)-FIND(\",\",Input2!$A$10)-1)),1)","v":"1900-01-01"},{"$f":"IFERROR(WEEKDAY(B54,2),0)","v":7},{"$f":"SUMIF(Input2!$B$15:$B$62,$AC$2,Input2!V$15:V$62)","v":0},{"$f":"SUMIF(Input2!$B$15:$B$62,$AC$2,Input2!W$15:W$62)","v":0},{"$f":"SUMIF(Input2!$B$15:$B$62,$AC$2,Input2!X$15:X$62)","v":0},{"$f":"SUMIF(Input2!$B$15:$B$62,$AC$2,Input2!Y$15:Y$62)","v":0},{"$f":"SUMIF(Input2!$B$15:$B$62,$AC$2,Input2!Z$15:Z$62)","v":0},{"$f":"SUMIF(Input2!$B$15:$B$62,$AC$2,Input2!AA$15:AA$62)","v":0},{"$f":"SUMIF(Input2!$B$15:$B$62,$AC$2,Input2!AB$15:AB$62)","v":0},{"$f":"SUMIF(Input2!$B$15:$B$62,$AC$2,Input2!AC$15:AC$62)","v":0},{"$f":"SUMIF(Input2!$B$15:$B$62,$AC$2,Input2!AD$15:AD$62)","v":0},{"$f":"SUMIF(Input2!$B$15:$B$62,$AC$2,Input2!AE$15:AE$62)","v":0},{"$f":"SUMIF(Input2!$B$15:$B$62,$AC$2,Input2!AF$15:AF$62)","v":0},{"$f":"SUMIF(Input2!$B$15:$B$62,$AC$2,Input2!AG$15:AG$62)","v":0},{"$f":"SUMPRODUCT((Input2!$B$15:$B$62=$AC$2)*Input2!AH$15:AK$62)","v":0},{"$f":"SUM(D54:P54)","v":0},{"$f":"SUMIFS(Input2!C$15:C$62,Input2!AL$15:AL$62,\">0\",Input2!B$15:B$62,\"P\")","v":0},{"$f":"IFERROR(SUMPRODUCT((Input2!B$15:B$62=\"P\")*Input2!C$15:C$62*Input2!AL$15:AL$62)/R54,0)","v":0},{"$f":"SUMIF(Input2!$B$15:$B$62,$AC$2,Input2!D$15:D$62)","v":0},{"$f":"SUMIF(Input2!$B$15:$B$62,$AC$2,Input2!E$15:E$62)","v":0},{"$f":"SUMIF(Input2!$B$15:$B$62,$AC$2,Input2!F$15:F$62)","v":0},{"$f":"SUMIF(Input2!$B$15:$B$62,$AC$2,Input2!G$15:G$62)","v":0},{"$f":"SUMIF(Input2!$B$15:$B$62,$AC$2,Input2!H$15:H$62)","v":0},{"$f":"SUMIF(Input2!$B$15:$B$62,$AC$2,Input2!I$15:I$62)","v":0},{"$f":"SUMIF(Input2!$B$15:$B$62,$AC$2,Input2!J$15:J$62)","v":0},{"$f":"SUMIF(Input2!$B$15:$B$62,$AC$2,Input2!K$15:K$62)","v":0},{"$f":"SUMIF(Input2!$B$15:$B$62,$AC$2,Input2!L$15:L$62)","v":0},{"$f":"SUMIF(Input2!$B$15:$B$62,$AC$2,Input2!M$15:M$62)","v":0},{"$f":"SUMIF(Input2!$B$15:$B$62,$AC$2,Input2!N$15:N$62)","v":0},{"$f":"SUMIF(Input2!$B$15:$B$62,$AC$2,Input2!O$15:O$62)","v":0},{"$f":"SUMIF(Input2!$B$15:$B$62,$AC$2,Input2!P$15:P$62)","v":0},{"$f":"SUMIF(Input2!$B$15:$B$62,$AC$2,Input2!Q$15:Q$62)","v":0},{"$f":"SUM(T54:AG54)","v":0},{"$f":"IFERROR(SUM(W54:AF54)/AH54,0)","v":0}]
[null,{"$f":"IFERROR(DATEVALUE(RIGHT(Input2!$A$73,LEN(Input2!$A$73)-FIND(\",\",Input2!$A$73)-1)),2)","v":"1900-01-02"},1,{"$f":"SUMIF(Input2!$B$78:$B$125,$AC$2,Input2!V$78:V$125)","v":0},{"$f":"SUMIF(Input2!$B$78:$B$125,$AC$2,Input2!W$78:W$125)","v":0},{"$f":"SUMIF(Input2!$B$78:$B$125,$AC$2,Input2!X$78:X$125)","v":0},{"$f":"SUMIF(Input2!$B$78:$B$125,$AC$2,Input2!Y$78:Y$125)","v":0},{"$f":"SUMIF(Input2!$B$78:$B$125,$AC$2,Input2!Z$78:Z$125)","v":0},{"$f":"SUMIF(Input2!$B$78:$B$125,$AC$2,Input2!AA$78:AA$125)","v":0},{"$f":"SUMIF(Input2!$B$78:$B$125,$AC$2,Input2!AB$78:AB$125)","v":0},{"$f":"SUMIF(Input2!$B$78:$B$125,$AC$2,Input2!AC$78:AC$125)","v":0},{"$f":"SUMIF(Input2!$B$78:$B$125,$AC$2,Input2!AD$78:AD$125)","v":0},{"$f":"SUMIF(Input2!$B$78:$B$125,$AC$2,Input2!AE$78:AE$125)","v":0},{"$f":"SUMIF(Input2!$B$78:$B$125,$AC$2,Input2!AF$78:AF$125)","v":0},{"$f":"SUMIF(Input2!$B$78:$B$125,$AC$2,Input2!AG$78:AG$125)","v":0},{"$f":"SUMPRODUCT((Input2!$B$78:$B$125=$AC$2)*Input2!AH$78:AK$125)","v":0},0,{"$f":"SUMIFS(Input2!C$78:C$125,Input2!AL$78:AL$125,\">0\",Input2!B$78:B$125,\"P\")","v":0},{"$f":"IFERROR(SUMPRODUCT((Input2!B$78:B$125=\"P\")*Input2!C$78:C$125*Input2!AL$78:AL$125)/R55,0)","v":0},{"$f":"SUMIF(Input2!$B$78:$B$125,$AC$2,Input2!D$78:D$125)","v":0},{"$f":"SUMIF(Input2!$B$78:$B$125,$AC$2,Input2!E$78:E$125)","v":0},{"$f":"SUMIF(Input2!$B$78:$B$125,$AC$2,Input2!F$78:F$125)","v":0},{"$f":"SUMIF(Input2!$B$78:$B$125,$AC$2,Input2!G$78:G$125)","v":0},{"$f":"SUMIF(Input2!$B$78:$B$125,$AC$2,Input2!H$78:H$125)","v":0},{"$f":"SUMIF(Input2!$B$78:$B$125,$AC$2,Input2!I$78:I$125)","v":0},{"$f":"SUMIF(Input2!$B$78:$B$125,$AC$2,Input2!J$78:J$125)","v":0},{"$f":"SUMIF(Input2!$B$78:$B$125,$AC$2,Input2!K$78:K$125)","v":0},{"$f":"SUMIF(Input2!$B$78:$B$125,$AC$2,Input2!L$78:L$125)","v":0},{"$f":"SUMIF(Input2!$B$78:$B$125,$AC$2,Input2!M$78:M$125)","v":0},{"$f":"SUMIF(Input2!$B$78:$B$125,$AC$2,Input2!N$78:N$125)","v":0},{"$f":"SUMIF(Input2!$B$78:$B$125,$AC$2,Input2!O$78:O$125)","v":0},{"$f":"SUMIF(Input2!$B$78:$B$125,$AC$2,Input2!P$78:P$125)","v":0},{"$f":"SUMIF(Input2!$B$78:$B$125,$AC$2,Input2!Q$78:Q$125)","v":0},0,0]
[null,{"$f":"IFERROR(DATEVALUE(RIGHT(Input2!$A$136,LEN(Input2!$A$136)-FIND(\",\",Input2!$A$136)-1)),3)","v":"1900-01-03"},2,{"$f":"SUMIF(Input2!$B$141:$B$188,$AC$2,Input2!V$141:V$188)","v":0},{"$f":"SUMIF(Input2!$B$141:$B$188,$AC$2,Input2!W$141:W$188)","v":0},{"$f":"SUMIF(Input2!$B$141:$B$188,$AC$2,Input2!X$141:X$188)","v":0},{"$f":"SUMIF(Input2!$B$141:$B$188,$AC$2,Input2!Y$141:Y$188)","v":0},{"$f":"SUMIF(Input2!$B$141:$B$188,$AC$2,Input2!Z$141:Z$188)","v":0},{"$f":"SUMIF(Input2!$B$141:$B$188,$AC$2,Input2!AA$141:AA$188)","v":0},{"$f":"SUMIF(Input2!$B$141:$B$188,$AC$2,Input2!AB$141:AB$188)","v":0},{"$f":"SUMIF(Input2!$B$141:$B$188,$AC$2,Input2!AC$141:AC$188)","v":0},{"$f":"SUMIF(Input2!$B$141:$B$188,$AC$2,Input2!AD$141:AD$188)","v":0},{"$f":"SUMIF(Input2!$B$141:$B$188,$AC$2,Input2!AE$141:AE$188)","v":0},{"$f":"SUMIF(Input2!$B$141:$B$188,$AC$2,Input2!AF$141:AF$188)","v":0},{"$f":"SUMIF(Input2!$B$141:$B$188,$AC$2,Input2!AG$141:AG$188)","v":0},{"$f":"SUMPRODUCT((Input2!$B$141:$B$188=$AC$2)*Input2!AH$141:AK$188)","v":0},0,{"$f":"SUMIFS(Input2!C$144:C$188,Input2!AL$144:AL$188,\">0\",Input2!B$144:B$188,\"P\")","v":0},{"$f":"IFERROR(SUMPRODUCT((Input2!B$141:B$188=\"P\")*Input2!C$141:C$188*Input2!AL$141:AL$188)/R56,0)","v":0},{"$f":"SUMIF(Input2!$B$141:$B$188,$AC$2,Input2!D$141:D$188)","v":0},{"$f":"SUMIF(Input2!$B$141:$B$188,$AC$2,Input2!E$141:E$188)","v":0},{"$f":"SUMIF(Input2!$B$141:$B$188,$AC$2,Input2!F$141:F$188)","v":0},{"$f":"SUMIF(Input2!$B$141:$B$188,$AC$2,Input2!G$141:G$188)","v":0},{"$f":"SUMIF(Input2!$B$141:$B$188,$AC$2,Input2!H$141:H$188)","v":0},{"$f":"SUMIF(Input2!$B$141:$B$188,$AC$2,Input2!I$141:I$188)","v":0},{"$f":"SUMIF(Input2!$B$141:$B$188,$AC$2,Input2!J$141:J$188)","v":0},{"$f":"SUMIF(Input2!$B$141:$B$188,$AC$2,Input2!K$141:K$188)","v":0},{"$f":"SUMIF(Input2!$B$141:$B$188,$AC$2,Input2!L$141:L$188)","v":0},{"$f":"SUMIF(Input2!$B$141:$B$188,$AC$2,Input2!M$141:M$188)","v":0},{"$f":"SUMIF(Input2!$B$141:$B$188,$AC$2,Input2!N$141:N$188)","v":0},{"$f":"SUMIF(Input2!$B$141:$B$188,$AC$2,Input2!O$141:O$188)","v":0},{"$f":"SUMIF(Input2!$B$141:$B$188,$AC$2,Input2!P$141:P$188)","v":0},{"$f":"SUMIF(Input2!$B$141:$B$188,$AC$2,Input2!Q$141:Q$188)","v":0},0,0]
[null,{"$f":"IFERROR(DATEVALUE(RIGHT(Input2!$A$199,LEN(Input2!$A$199)-FIND(\",\",Input2!$A$199)-1)),4)","v":"1900-01-04"},3,{"$f":"SUMIF(Input2!$B$204:$B$251,$AC$2,Input2!V$204:V$251)","v":0},{"$f":"SUMIF(Input2!$B$204:$B$251,$AC$2,Input2!W$204:W$251)","v":0},{"$f":"SUMIF(Input2!$B$204:$B$251,$AC$2,Input2!X$204:X$251)","v":0},{"$f":"SUMIF(Input2!$B$204:$B$251,$AC$2,Input2!Y$204:Y$251)","v":0},{"$f":"SUMIF(Input2!$B$204:$B$251,$AC$2,Input2!Z$204:Z$251)","v":0},{"$f":"SUMIF(Input2!$B$204:$B$251,$AC$2,Input2!AA$204:AA$251)","v":0},{"$f":"SUMIF(Input2!$B$204:$B$251,$AC$2,Input2!AB$204:AB$251)","v":0},{"$f":"SUMIF(Input2!$B$204:$B$251,$AC$2,Input2!AC$204:AC$251)","v":0},{"$f":"SUMIF(Input2!$B$204:$B$251,$AC$2,Input2!AD$204:AD$251)","v":0},{"$f":"SUMIF(Input2!$B$204:$B$251,$AC$2,Input2!AE$204:AE$251)","v":0},{"$f":"SUMIF(Input2!$B$204:$B$251,$AC$2,Input2!AF$204:AF$251)","v":0},{"$f":"SUMIF(Input2!$B$204:$B$251,$AC$2,Input2!AG$204:AG$251)","v":0},{"$f":"SUMPRODUCT((Input2!$B$204:$B$251=$AC$2)*Input2!AH$204:AK$251)","v":0},0,{"$f":"SUMIFS(Input2!C$204:C$251,Input2!AL$204:AL$251,\">0\",Input2!B$204:B$251,\"P\")","v":0},{"$f":"IFERROR(SUMPRODUCT((Input2!B$204:B$251=\"P\")*Input2!C$204:C$251*Input2!AL$204:AL$251)/R57,0)","v":0},{"$f":"SUMIF(Input2!$B$204:$B$251,$AC$2,Input2!D$204:D$251)","v":0},{"$f":"SUMIF(Input2!$B$204:$B$251,$AC$2,Input2!E$204:E$251)","v":0},{"$f":"SUMIF(Input2!$B$204:$B$251,$AC$2,Input2!F$204:F$251)","v":0},{"$f":"SUMIF(Input2!$B$204:$B$251,$AC$2,Input2!G$204:G$251)","v":0},{"$f":"SUMIF(Input2!$B$204:$B$251,$AC$2,Input2!H$204:H$251)","v":0},{"$f":"SUMIF(Input2!$B$204:$B$251,$AC$2,Input2!I$204:I$251)","v":0},{"$f":"SUMIF(Input2!$B$204:$B$251,$AC$2,Input2!J$204:J$251)","v":0},{"$f":"SUMIF(Input2!$B$204:$B$251,$AC$2,Input2!K$204:K$251)","v":0},{"$f":"SUMIF(Input2!$B$204:$B$251,$AC$2,Input2!L$204:L$251)","v":0},{"$f":"SUMIF(Input2!$B$204:$B$251,$AC$2,Input2!M$204:M$251)","v":0},{"$f":"SUMIF(Input2!$B$204:$B$251,$AC$2,Input2!N$204:N$251)","v":0},{"$f":"SUMIF(Input2!$B$204:$B$251,$AC$2,Input2!O$204:O$251)","v":0},{"$f":"SUMIF(Input2!$B$204:$B$251,$AC$2,Input2!P$204:P$251)","v":0},{"$f":"SUMIF(Input2!$B$204:$B$251,$AC$2,Input2!Q$204:Q$251)","v":0},0,0]
[null,{"$f":"IFERROR(DATEVALUE(RIGHT(Input2!$A$262,LEN(Input2!$A$262)-FIND(\",\",Input2!$A$262)-1)),5)","v":"1900-01-05"},4,{"$f":"SUMIF(Input2!$B$267:$B$314,$AC$2,Input2!V$267:V$314)","v":0},{"$f":"SUMIF(Input2!$B$267:$B$314,$AC$2,Input2!W$267:W$314)","v":0},{"$f":"SUMIF(Input2!$B$267:$B$314,$AC$2,Input2!X$267:X$314)","v":0},{"$f":"SUMIF(Input2!$B$267:$B$314,$AC$2,Input2!Y$267:Y$314)","v":0},{"$f":"SUMIF(Input2!$B$267:$B$314,$AC$2,Input2!Z$267:Z$314)","v":0},{"$f":"SUMIF(Input2!$B$267:$B$314,$AC$2,Input2!AA$267:AA$314)","v":0},{"$f":"SUMIF(Input2!$B$267:$B$314,$AC$2,Input2!AB$267:AB$314)","v":0},{"$f":"SUMIF(Input2!$B$267:$B$314,$AC$2,Input2!AC$267:AC$314)","v":0},{"$f":"SUMIF(Input2!$B$267:$B$314,$AC$2,Input2!AD$267:AD$314)","v":0},{"$f":"SUMIF(Input2!$B$267:$B$314,$AC$2,Input2!AE$267:AE$314)","v":0},{"$f":"SUMIF(Input2!$B$267:$B$314,$AC$2,Input2!AF$267:AF$314)","v":0},{"$f":"SUMIF(Input2!$B$267:$B$314,$AC$2,Input2!AG$267:AG$314)","v":0},{"$f":"SUMPRODUCT((Input2!$B$267:$B$314=$AC$2)*Input2!AH$267:AK$314)","v":0},0,{"$f":"SUMIFS(Input2!C$267:C$314,Input2!AL$267:AL$314,\">0\",Input2!B$267:B$314,\"P\")","v":0},{"$f":"IFERROR(SUMPRODUCT((Input2!B$267:B$314=\"P\")*Input2!C$267:C$314*Input2!AL$267:AL$314)/R58,0)","v":0},{"$f":"SUMIF(Input2!$B$267:$B$314,$AC$2,Input2!D$267:D$314)","v":0},{"$f":"SUMIF(Input2!$B$267:$B$314,$AC$2,Input2!E$267:E$314)","v":0},{"$f":"SUMIF(Input2!$B$267:$B$314,$AC$2,Input2!F$267:F$314)","v":0},{"$f":"SUMIF(Input2!$B$267:$B$314,$AC$2,Input2!G$267:G$314)","v":0},{"$f":"SUMIF(Input2!$B$267:$B$314,$AC$2,Input2!H$267:H$314)","v":0},{"$f":"SUMIF(Input2!$B$267:$B$314,$AC$2,Input2!I$267:I$314)","v":0},{"$f":"SUMIF(Input2!$B$267:$B$314,$AC$2,Input2!J$267:J$314)","v":0},{"$f":"SUMIF(Input2!$B$267:$B$314,$AC$2,Input2!K$267:K$314)","v":0},{"$f":"SUMIF(Input2!$B$267:$B$314,$AC$2,Input2!L$267:L$314)","v":0},{"$f":"SUMIF(Input2!$B$267:$B$314,$AC$2,Input2!M$267:M$314)","v":0},{"$f":"SUMIF(Input2!$B$267:$B$314,$AC$2,Input2!N$267:N$314)","v":0},{"$f":"SUMIF(Input2!$B$267:$B$314,$AC$2,Input2!O$267:O$314)","v":0},{"$f":"SUMIF(Input2!$B$267:$B$314,$AC$2,Input2!P$267:P$314)","v":0},{"$f":"SUMIF(Input2!$B$267:$B$314,$AC$2,Input2!Q$267:Q$314)","v":0},0,0]
[null,{"$f":"IFERROR(DATEVALUE(RIGHT(Input2!$A$325,LEN(Input2!$A$325)-FIND(\",\",Input2!$A$325)-1)),6)","v":"1900-01-06"},5,{"$f":"SUMIF(Input2!$B$330:$B$377,$AC$2,Input2!V$330:V$377)","v":0},{"$f":"SUMIF(Input2!$B$330:$B$377,$AC$2,Input2!W$330:W$377)","v":0},{"$f":"SUMIF(Input2!$B$330:$B$377,$AC$2,Input2!X$330:X$377)","v":0},{"$f":"SUMIF(Input2!$B$330:$B$377,$AC$2,Input2!Y$330:Y$377)","v":0},{"$f":"SUMIF(Input2!$B$330:$B$377,$AC$2,Input2!Z$330:Z$377)","v":0},{"$f":"SUMIF(Input2!$B$330:$B$377,$AC$2,Input2!AA$330:AA$377)","v":0},{"$f":"SUMIF(Input2!$B$330:$B$377,$AC$2,Input2!AB$330:AB$377)","v":0},{"$f":"SUMIF(Input2!$B$330:$B$377,$AC$2,Input2!AC$330:AC$377)","v":0},{"$f":"SUMIF(Input2!$B$330:$B$377,$AC$2,Input2!AD$330:AD$377)","v":0},{"$f":"SUMIF(Input2!$B$330:$B$377,$AC$2,Input2!AE$330:AE$377)","v":0},{"$f":"SUMIF(Input2!$B$330:$B$377,$AC$2,Input2!AF$330:AF$377)","v":0},{"$f":"SUMIF(Input2!$B$330:$B$377,$AC$2,Input2!AG$330:AG$377)","v":0},{"$f":"SUMPRODUCT((Input2!$B$330:$B$377=$AC$2)*Input2!AH$330:AK$377)","v":0},0,{"$f":"SUMIFS(Input2!C$330:C$377,Input2!AL$330:AL$377,\">0\",Input2!B$330:B$377,\"P\")","v":0},{"$f":"IFERROR(SUMPRODUCT((Input2!B$330:B$377=\"P\")*Input2!C$330:C$377*Input2!AL$330:AL$377)/R59,0)","v":0},{"$f":"SUMIF(Input2!$B$330:$B$377,$AC$2,Input2!D$330:D$377)","v":0},{"$f":"SUMIF(Input2!$B$330:$B$377,$AC$2,Input2!E$330:E$377)","v":0},{"$f":"SUMIF(Input2!$B$330:$B$377,$AC$2,Input2!F$330:F$377)","v":0},{"$f":"SUMIF(Input2!$B$330:$B$377,$AC$2,Input2!G$330:G$377)","v":0},{"$f":"SUMIF(Input2!$B$330:$B$377,$AC$2,Input2!H$330:H$377)","v":0},{"$f":"SUMIF(Input2!$B$330:$B$377,$AC$2,Input2!I$330:I$377)","v":0},{"$f":"SUMIF(Input2!$B$330:$B$377,$AC$2,Input2!J$330:J$377)","v":0},{"$f":"SUMIF(Input2!$B$330:$B$377,$AC$2,Input2!K$330:K$377)","v":0},{"$f":"SUMIF(Input2!$B$330:$B$377,$AC$2,Input2!L$330:L$377)","v":0},{"$f":"SUMIF(Input2!$B$330:$B$377,$AC$2,Input2!M$330:M$377)","v":0},{"$f":"SUMIF(Input2!$B$330:$B$377,$AC$2,Input2!N$330:N$377)","v":0},{"$f":"SUMIF(Input2!$B$330:$B$377,$AC$2,Input2!O$330:O$377)","v":0},{"$f":"SUMIF(Input2!$B$330:$B$377,$AC$2,Input2!P$330:P$377)","v":0},{"$f":"SUMIF(Input2!$B$330:$B$377,$AC$2,Input2!Q$330:Q$377)","v":0},0,0]
[null,{"$f":"IFERROR(DATEVALUE(RIGHT(Input2!$A$388,LEN(Input2!$A$388)-FIND(\",\",Input2!$A$388)-1)),7)","v":"1900-01-07"},6,{"$f":"SUMIF(Input2!$B$393:$B$440,$AC$2,Input2!V$393:V$440)","v":0},{"$f":"SUMIF(Input2!$B$393:$B$440,$AC$2,Input2!W$393:W$440)","v":0},{"$f":"SUMIF(Input2!$B$393:$B$440,$AC$2,Input2!X$393:X$440)","v":0},{"$f":"SUMIF(Input2!$B$393:$B$440,$AC$2,Input2!Y$393:Y$440)","v":0},{"$f":"SUMIF(Input2!$B$393:$B$440,$AC$2,Input2!Z$393:Z$440)","v":0},{"$f":"SUMIF(Input2!$B$393:$B$440,$AC$2,Input2!AA$393:AA$440)","v":0},{"$f":"SUMIF(Input2!$B$393:$B$440,$AC$2,Input2!AB$393:AB$440)","v":0},{"$f":"SUMIF(Input2!$B$393:$B$440,$AC$2,Input2!AC$393:AC$440)","v":0},{"$f":"SUMIF(Input2!$B$393:$B$440,$AC$2,Input2!AD$393:AD$440)","v":0},{"$f":"SUMIF(Input2!$B$393:$B$440,$AC$2,Input2!AE$393:AE$440)","v":0},{"$f":"SUMIF(Input2!$B$393:$B$440,$AC$2,Input2!AF$393:AF$440)","v":0},{"$f":"SUMIF(Input2!$B$393:$B$440,$AC$2,Input2!AG$393:AG$440)","v":0},{"$f":"SUMPRODUCT((Input2!$B$393:$B$440=$AC$2)*Input2!AH$393:AK$440)","v":0},0,{"$f":"SUMIFS(Input2!C$393:C$440,Input2!AL$393:AL$440,\">0\",Input2!B$393:B$440,\"P\")","v":0},{"$f":"IFERROR(SUMPRODUCT((Input2!B$393:B$440=\"P\")*Input2!C$393:C$440*Input2!AL$393:AL$440)/R60,0)","v":0},{"$f":"SUMIF(Input2!$B$393:$B$440,$AC$2,Input2!D$393:D$440)","v":0},{"$f":"SUMIF(Input2!$B$393:$B$440,$AC$2,Input2!E$393:E$440)","v":0},{"$f":"SUMIF(Input2!$B$393:$B$440,$AC$2,Input2!F$393:F$440)","v":0},{"$f":"SUMIF(Input2!$B$393:$B$440,$AC$2,Input2!G$393:G$440)","v":0},{"$f":"SUMIF(Input2!$B$393:$B$440,$AC$2,Input2!H$393:H$440)","v":0},{"$f":"SUMIF(Input2!$B$393:$B$440,$AC$2,Input2!I$393:I$440)","v":0},{"$f":"SUMIF(Input2!$B$393:$B$440,$AC$2,Input2!J$393:J$440)","v":0},{"$f":"SUMIF(Input2!$B$393:$B$440,$AC$2,Input2!K$393:K$440)","v":0},{"$f":"SUMIF(Input2!$B$393:$B$440,$AC$2,Input2!L$393:L$440)","v":0},{"$f":"SUMIF(Input2!$B$393:$B$440,$AC$2,Input2!M$393:M$440)","v":0},{"$f":"SUMIF(Input2!$B$393:$B$440,$AC$2,Input2!N$393:N$440)","v":0},{"$f":"SUMIF(Input2!$B$393:$B$440,$AC$2,Input2!O$393:O$440)","v":0},{"$f":"SUMIF(Input2!$B$393:$B$440,$AC$2,Input2!P$393:P$440)","v":0},{"$f":"SUMIF(Input2!$B$393:$B$440,$AC$2,Input2!Q$393:Q$440)","v":0},0,0]
[null,"Total",null,{"$f":"SUM(D54:D60)","v":0},0,0,0,0,0,0,0,0,0,0,0,0,0,0,{"$f":"IFERROR(SUMPRODUCT(R54:R60,S54:S60)/R61,0)","v":0},{"$f":"SUM(T54:T60)","v":0},0,0,0,0,0,0,0,0,0,0,0,0,0,0,0]
[]
[null,{"$f":"\"Direction 2/Lane 2 : Towards \"&Input!B5","v":"Direction 2/Lane 2 : Towards DUNCANSBY RD"}]
[null,null,null,"Summary of Speed Classification",null,null,null,null,null,null,null,null,null,null,null,null,null,null,null,"Summary of Vehicle Classification"]
[null,"Date",null,"<10","10-20","20-30","30-40","40-50","50-60","60-70","70-80","80-90","90-100","100-110","110-120","121+","Daily","85th Percentile",null,"CL1","CL2","CL3","CL4","CL5","CL6","CL7","CL8","CL9","CL10","CL11","CL12","CL13","CL14","Daily","%HCV"]
[null,{"$f":"IFERROR(TEXT(B67,\"MMMM\"),0)","v":"January"},"Day",null,null,null,null,null,null,null,null,null,null,null,null,null,"Total","Total","Speed",null,null,null,null,null,null,null,null,null,null,null,null,null,null,"Total"]
[null,{"$f":"IFERROR(DATEVALUE(RIGHT(Input2!$A$10,LEN(Input2!$A$10)-FIND(\",\",Input2!$A$10)-1)),1)","v":"1900-01-01"},{"$f":"IFERROR(WEEKDAY(B67,2),0)","v":7},{"$f":"SUMIF(Input2!$B$15:$B$62,$AD$2,Input2!V$15:V$62)","v":0},{"$f":"SUMIF(Input2!$B$15:$B$62,$AD$2,Input2!W$15:W$62)","v":0},{"$f":"SUMIF(Input2!$B$15:$B$62,$AD$2,Input2!X$15:X$62)","v":0},{"$f":"SUMIF(Input2!$B$15:$B$62,$AD$2,Input2!Y$15:Y$62)","v":0},{"$f":"SUMIF(Input2!$B$15:$B$62,$AD$2,Input2!Z$15:Z$62)","v":0},{"$f":"SUMIF(Input2!$B$15:$B$62,$AD$2,Input2!AA$15:AA$62)","v":0},{"$f":"SUMIF(Input2!$B$15:$B$62,$AD$2,Input2!AB$15:AB$62)","v":0},{"$f":"SUMIF(Input2!$B$15:$B$62,$AD$2,Input2!AC$15:AC$62)","v":0},{"$f":"SUMIF(Input2!$B$15:$B$62,$AD$2,Input2!AD$15:AD$62)","v":0},{"$f":"SUMIF(Input2!$B$15:$B$62,$AD$2,Input2!AE$15:AE$62)","v":0},{"$f":"SUMIF(Input2!$B$15:$B$62,$AD$2,Input2!AF$15:AF$62)","v":0},{"$f":"SUMIF(Input2!$B$15:$B$62,$AD$2,Input2!AG$15:AG$62)","v":0},{"$f":"SUMPRODUCT((Input2!$B$15:$B$62=$AD$2)*Input2!AH$15:AK$62)","v":0},{"$f":"SUM(D67:P67)","v":0},{"$f":"SUMIFS(Input2!C$15:C$62,Input2!AL$15:AL$62,\">0\",Input2!B$15:B$62,\"S\")","v":0},{"$f":"IFERROR(SUMPRODUCT((Input2!B$15:B$62=\"S\")*Input2!C$15:C$62*Input2!AL$15:AL$62)/R67,0)","v":0},{"$f":"SUMIF(Input2!$B$15:$B$62,$AD$2,Input2!D$15:D$62)","v":0},{"$f":"SUMIF(Input2!$B$15:$B$62,$AD$2,Input2!E$15:E$62)","v":0},{"$f":"SUMIF(Input2!$B$15:$B$62,$AD$2,Input2!F$15:F$62)","v":0},{"$f":"SUMIF(Input2!$B$15:$B$62,$AD$2,Input2!G$15:G$62)","v":0},{"$f":"SUMIF(Input2!$B$15:$B$62,$AD$2,Input2!H$15:H$62)","v":0},{"$f":"SUMIF(Input2!$B$15:$B$62,$AD$2,Input2!I$15:I$62)","v":0},{"$f":"SUMIF(Input2!$B$15:$B$62,$AD$2,Input2!J$15:J$62)","v":0},{"$f":"SUMIF(Input2!$B$15:$B$62,$AD$2,Input2!K$15:K$62)","v":0},{"$f":"SUMIF(Input2!$B$15:$B$62,$AD$2,Input2!L$15:L$62)","v":0},{"$f":"SUMIF(Input2!$B$15:$B$62,$AD$2,Input2!M$15:M$62)","v":0},{"$f":"SUMIF(Input2!$B$15:$B$62,$AD$2,Input2!N$15:N$62)","v":0},{"$f":"SUMIF(Input2!$B$15:$B$62,$AD$2,Input2!O$15:O$62)","v":0},{"$f":"SUMIF(Input2!$B$15:$B$62,$AD$2,Input2!P$15:P$62)","v":0},{"$f":"SUMIF(Input2!$B$15:$B$62,$AD$2,Input2!Q$15:Q$62)","v":0},{"$f":"SUM(T67:AG67)","v":0},{"$f":"IFERROR(SUM(W67:AF67)/AH67,0)","v":0}]
[null,{"$f":"IFERROR(DATEVALUE(RIGHT(Input2!$A$73,LEN(Input2!$A$73)-FIND(\",\",Input2!$A$73)-1)),2)","v":"1900-01-02"},1,{"$f":"SUMIF(Input2!$B$78:$B$125,$AD$2,Input2!V$78:V$125)","v":0},{"$f":"SUMIF(Input2!$B$78:$B$125,$AD$2,Input2!W$78:W$125)","v":0},{"$f":"SUMIF(Input2!$B$78:$B$125,$AD$2,Input2!X$78:X$125)","v":0},{"$f":"SUMIF(Input2!$B$78:$B$125,$AD$2,Input2!Y$78:Y$125)","v":0},{"$f":"SUMIF(Input2!$B$78:$B$125,$AD$2,Input2!Z$78:Z$125)","v":0},{"$f":"SUMIF(Input2!$B$78:$B$125,$AD$2,Input2!AA$78:AA$125)","v":0},{"$f":"SUMIF(Input2!$B$78:$B$125,$AD$2,Input2!AB$78:AB$125)","v":0},{"$f":"SUMIF(Input2!$B$78:$B$125,$AD$2,Input2!AC$78:AC$125)","v":0},{"$f":"SUMIF(Input2!$B$78:$B$125,$AD$2,Input2!AD$78:AD$125)","v":0},{"$f":"SUMIF(Input2!$B$78:$B$125,$AD$2,Input2!AE$78:AE$125)","v":0},{"$f":"SUMIF(Input2!$B$78:$B$125,$AD$2,Input2!AF$78:AF$125)","v":0},{"$f":"SUMIF(Input2!$B$78:$B$125,$AD$2,Input2!AG$78:AG$125)","v":0},{"$f":"SUMPRODUCT((Input2!$B$78:$B$125=$AD$2)*Input2!AH$78:AK$125)","v":0},0,{"$f":"SUMIFS(Input2!C$78:C$125,Input2!AL$78:AL$125,\">0\",Input2!B$78:B$125,\"S\")","v":0},{"$f":"IFERROR(SUMPRODUCT((Input2!B$78:B$125=\"S\")*Input2!C$78:C$125*Input2!AL$78:AL$125)/R68,0)","v":0},{"$f":"SUMIF(Input2!$B$78:$B$125,$AD$2,Input2!D$78:D$125)","v":0},{"$f":"SUMIF(Input2!$B$78:$B$125,$AD$2,Input2!E$78:E$125)","v":0},{"$f":"SUMIF(Input2!$B$78:$B$125,$AD$2,Input2!F$78:F$125)","v":0},{"$f":"SUMIF(Input2!$B$78:$B$125,$AD$2,Input2!G$78:G$125)","v":0},{"$f":"SUMIF(Input2!$B$78:$B$125,$AD$2,Input2!H$78:H$125)","v":0},{"$f":"SUMIF(Input2!$B$78:$B$125,$AD$2,Input2!I$78:I$125)","v":0},{"$f":"SUMIF(Input2!$B$78:$B$125,$AD$2,Input2!J$78:J$125)","v":0},{"$f":"SUMIF(Input2!$B$78:$B$125,$AD$2,Input2!K$78:K$125)","v":0},{"$f":"SUMIF(Input2!$B$78:$B$125,$AD$2,Input2!L$78:L$125)","v":0},{"$f":"SUMIF(Input2!$B$78:$B$125,$AD$2,Input2!M$78:M$125)","v":0},{"$f":"SUMIF(Input2!$B$78:$B$125,$AD$2,Input2!N$78:N$125)","v":0},{"$f":"SUMIF(Input2!$B$78:$B$125,$AD$2,Input2!O$78:O$125)","v":0},{"$f":"SUMIF(Input2!$B$78:$B$125,$AD$2,Input2!P$78:P$125)","v":0},{"$f":"SUMIF(Input2!$B$78:$B$125,$AD$2,Input2!Q$78:Q$125)","v":0},0,0]
[null,{"$f":"IFERROR(DATEVALUE(RIGHT(Input2!$A$136,LEN(Input2!$A$136)-FIND(\",\",Input2!$A$136)-1)),3)","v":"1900-01-03"},2,{"$f":"SUMIF(Input2!$B$141:$B$188,$AD$2,Input2!V$141:V$188)","v":0},{"$f":"SUMIF(Input2!$B$141:$B$188,$AD$2,Input2!W$141:W$188)","v":0},{"$f":"SUMIF(Input2!$B$141:$B$188,$AD$2,Input2!X$141:X$188)","v":0},{"$f":"SUMIF(Input2!$B$141:$B$188,$AD$2,Input2!Y$141:Y$188)","v":0},{"$f":"SUMIF(Input2!$B$141:$B$188,$AD$2,Input2!Z$141:Z$188)","v":0},{"$f":"SUMIF(Input2!$B$141:$B$188,$AD$2,Input2!AA$141:AA$188)","v":0},{"$f":"SUMIF(Input2!$B$141:$B$188,$AD$2,Input2!AB$141:AB$188)","v":0},{"$f":"SUMIF(Input2!$B$141:$B$188,$AD$2,Input2!AC$141:AC$188)","v":0},{"$f":"SUMIF(Input2!$B$141:$B$188,$AD$2,Input2!AD$141:AD$188)","v":0},{"$f":"SUMIF(Input2!$B$141:$B$188,$AD$2,Input2!AE$141:AE$188)","v":0},{"$f":"SUMIF(Input2!$B$141:$B$188,$AD$2,Input2!AF$141:AF$188)","v":0},{"$f":"SUMIF(Input2!$B$141:$B$188,$AD$2,Input2!AG$141:AG$188)","v":0},{"$f":"SUMPRODUCT((Input2!$B$141:$B$188=$AD$2)*Input2!AH$141:AK$188)","v":0},0,{"$f":"SUMIFS(Input2!C$144:C$188,Input2!AL$144:AL$188,\">0\",Input2!B$144:B$188,\"S\")","v":0},{"$f":"IFERROR(SUMPRODUCT((Input2!B$141:B$188=\"S\")*Input2!C$141:C$188*Input2!AL$141:AL$188)/R69,0)","v":0},{"$f":"SUMIF(Input2!$B$141:$B$188,$AD$2,Input2!D$141:D$188)","v":0},{"$f":"SUMIF(Input2!$B$141:$B$188,$AD$2,Input2!E$141:E$188)","v":0},{"$f":"SUMIF(Input2!$B$141:$B$188,$AD$2,Input2!F$141:F$188)","v":0},{"$f":"SUMIF(Input2!$B$141:$B$188,$AD$2,Input2!G$141:G$188)","v":0},{"$f":"SUMIF(Input2!$B$141:$B$188,$AD$2,Input2!H$141:H$188)","v":0},{"$f":"SUMIF(Input2!$B$141:$B$188,$AD$2,Input2!I$141:I$188)","v":0},{"$f":"SUMIF(Input2!$B$141:$B$188,$AD$2,Input2!J$141:J$188)","v":0},{"$f":"SUMIF(Input2!$B$141:$B$188,$AD$2,Input2!K$141:K$188)","v":0},{"$f":"SUMIF(Input2!$B$141:$B$188,$AD$2,Input2!L$141:L$188)","v":0},{"$f":"SUMIF(Input2!$B$141:$B$188,$AD$2,Input2!M$141:M$188)","v":0},{"$f":"SUMIF(Input2!$B$141:$B$188,$AD$2,Input2!N$141:N$188)","v":0},{"$f":"SUMIF(Input2!$B$141:$B$188,$AD$2,Input2!O$141:O$188)","v":0},{"$f":"SUMIF(Input2!$B$141:$B$188,$AD$2,Input2!P$141:P$188)","v":0},{"$f":"SUMIF(Input2!$B$141:$B$188,$AD$2,Input2!Q$141:Q$188)","v":0},0,0]
[null,{"$f":"IFERROR(DATEVALUE(RIGHT(Input2!$A$199,LEN(Input2!$A$199)-FIND(\",\",Input2!$A$199)-1)),4)","v":"1900-01-04"},3,{"$f":"SUMIF(Input2!$B$204:$B$251,$AD$2,Input2!V$204:V$251)","v":0},{"$f":"SUMIF(Input2!$B$204:$B$251,$AD$2,Input2!W$204:W$251)","v":0},{"$f":"SUMIF(Input2!$B$204:$B$251,$AD$2,Input2!X$204:X$251)","v":0},{"$f":"SUMIF(Input2!$B$204:$B$251,$AD$2,Input2!Y$204:Y$251)","v":0},{"$f":"SUMIF(Input2!$B$204:$B$251,$AD$2,Input2!Z$204:Z$251)","v":0},{"$f":"SUMIF(Input2!$B$204:$B$251,$AD$2,Input2!AA$204:AA$251)","v":0},{"$f":"SUMIF(Input2!$B$204:$B$251,$AD$2,Input2!AB$204:AB$251)","v":0},{"$f":"SUMIF(Input2!$B$204:$B$251,$AD$2,Input2!AC$204:AC$251)","v":0},{"$f":"SUMIF(Input2!$B$204:$B$251,$AD$2,Input2!AD$204:AD$251)","v":0},{"$f":"SUMIF(Input2!$B$204:$B$251,$AD$2,Input2!AE$204:AE$251)","v":0},{"$f":"SUMIF(Input2!$B$204:$B$251,$AD$2,Input2!AF$204:AF$251)","v":0},{"$f":"SUMIF(Input2!$B$204:$B$251,$AD$2,Input2!AG$204:AG$251)","v":0},{"$f":"SUMPRODUCT((Input2!$B$204:$B$251=$AD$2)*Input2!AH$204:AK$251)","v":0},0,{"$f":"SUMIFS(Input2!C$204:C$251,Input2!AL$204:AL$251,\">0\",Input2!B$204:B$251,\"S\")","v":0},{"$f":"IFERROR(SUMPRODUCT((Input2!B$204:B$251=\"S\")*Input2!C$204:C$251*Input2!AL$204:AL$251)/R70,0)","v":0},{"$f":"SUMIF(Input2!$B$204:$B$251,$AD$2,Input2!D$204:D$251)","v":0},{"$f":"SUMIF(Input2!$B$204:$B$251,$AD$2,Input2!E$204:E$251)","v":0},{"$f":"SUMIF(Input2!$B$204:$B$251,$AD$2,Input2!F$204:F$251)","v":0},{"$f":"SUMIF(Input2!$B$204:$B$251,$AD$2,Input2!G$204:G$251)","v":0},{"$f":"SUMIF(Input2!$B$204:$B$251,$AD$2,Input2!H$204:H$251)","v":0},{"$f":"SUMIF(Input2!$B$204:$B$251,$AD$2,Input2!I$204:I$251)","v":0},{"$f":"SUMIF(Input2!$B$204:$B$251,$AD$2,Input2!J$204:J$251)","v":0},{"$f":"SUMIF(Input2!$B$204:$B$251,$AD$2,Input2!K$204:K$251)","v":0},{"$f":"SUMIF(Input2!$B$204:$B$251,$AD$2,Input2!L$204:L$251)","v":0},{"$f":"SUMIF(Input2!$B$204:$B$251,$AD$2,Input2!M$204:M$251)","v":0},{"$f":"SUMIF(Input2!$B$204:$B$251,$AD$2,Input2!N$204:N$251)","v":0},{"$f":"SUMIF(Input2!$B$204:$B$251,$AD$2,Input2!O$204:O$251)","v":0},{"$f":"SUMIF(Input2!$B$204:$B$251,$AD$2,Input2!P$204:P$251)","v":0},{"$f":"SUMIF(Input2!$B$204:$B$251,$AD$2,Input2!Q$204:Q$251)","v":0},0,0]
[null,{"$f":"IFERROR(DATEVALUE(RIGHT(Input2!$A$262,LEN(Input2!$A$262)-FIND(\",\",Input2!$A$262)-1)),5)","v":"1900-01-05"},4,{"$f":"SUMIF(Input2!$B$267:$B$314,$AD$2,Input2!V$267:V$314)","v":0},{"$f":"SUMIF(Input2!$B$267:$B$314,$AD$2,Input2!W$267:W$314)","v":0},{"$f":"SUMIF(Input2!$B$267:$B$314,$AD$2,Input2!X$267:X$314)","v":0},{"$f":"SUMIF(Input2!$B$267:$B$314,$AD$2,Input2!Y$267:Y$314)","v":0},{"$f":"SUMIF(Input2!$B$267:$B$314,$AD$2,Input2!Z$267:Z$314)","v":0},{"$f":"SUMIF(Input2!$B$267:$B$314,$AD$2,Input2!AA$267:AA$314)","v":0},{"$f":"SUMIF(Input2!$B$267:$B$314,$AD$2,Input2!AB$267:AB$314)","v":0},{"$f":"SUMIF(Input2!$B$267:$B$314,$AD$2,Input2!AC$267:AC$314)","v":0},{"$f":"SUMIF(Input2!$B$267:$B$314,$AD$2,Input2!AD$267:AD$314)","v":0},{"$f":"SUMIF(Input2!$B$267:$B$314,$AD$2,Input2!AE$267:AE$314)","v":0},{"$f":"SUMIF(Input2!$B$267:$B$314,$AD$2,Input2!AF$267:AF$314)","v":0},{"$f":"SUMIF(Input2!$B$267:$B$314,$AD$2,Input2!AG$267:AG$314)","v":0},{"$f":"SUMPRODUCT((Input2!$B$267:$B$314=$AD$2)*Input2!AH$267:AK$314)","v":0},0,{"$f":"SUMIFS(Input2!C$267:C$314,Input2!AL$267:AL$314,\">0\",Input2!B$267:B$314,\"S\")","v":0},{"$f":"IFERROR(SUMPRODUCT((Input2!B$267:B$314=\"S\")*Input2!C$267:C$314*Input2!AL$267:AL$314)/R71,0)","v":0},{"$f":"SUMIF(Input2!$B$267:$B$314,$AD$2,Input2!D$267:D$314)","v":0},{"$f":"SUMIF(Input2!$B$267:$B$314,$AD$2,Input2!E$267:E$314)","v":0},{"$f":"SUMIF(Input2!$B$267:$B$314,$AD$2,Input2!F$267:F$314)","v":0},{"$f":"SUMIF(Input2!$B$267:$B$314,$AD$2,Input2!G$267:G$314)","v":0},{"$f":"SUMIF(Input2!$B$267:$B$314,$AD$2,Input2!H$267:H$314)","v":0},{"$f":"SUMIF(Input2!$B$267:$B$314,$AD$2,Input2!I$267:I$314)","v":0},{"$f":"SUMIF(Input2!$B$267:$B$314,$AD$2,Input2!J$267:J$314)","v":0},{"$f":"SUMIF(Input2!$B$267:$B$314,$AD$2,Input2!K$267:K$314)","v":0},{"$f":"SUMIF(Input2!$B$267:$B$314,$AD$2,Input2!L$267:L$314)","v":0},{"$f":"SUMIF(Input2!$B$267:$B$314,$AD$2,Input2!M$267:M$314)","v":0},{"$f":"SUMIF(Input2!$B$267:$B$314,$AD$2,Input2!N$267:N$314)","v":0},{"$f":"SUMIF(Input2!$B$267:$B$314,$AD$2,Input2!O$267:O$314)","v":0},{"$f":"SUMIF(Input2!$B$267:$B$314,$AD$2,Input2!P$267:P$314)","v":0},{"$f":"SUMIF(Input2!$B$267:$B$314,$AD$2,Input2!Q$267:Q$314)","v":0},0,0]
[null,{"$f":"IFERROR(DATEVALUE(RIGHT(Input2!$A$325,LEN(Input2!$A$325)-FIND(\",\",Input2!$A$325)-1)),6)","v":"1900-01-06"},5,{"$f":"SUMIF(Input2!$B$330:$B$377,$AD$2,Input2!V$330:V$377)","v":0},{"$f":"SUMIF(Input2!$B$330:$B$377,$AD$2,Input2!W$330:W$377)","v":0},{"$f":"SUMIF(Input2!$B$330:$B$377,$AD$2,Input2!X$330:X$377)","v":0},{"$f":"SUMIF(Input2!$B$330:$B$377,$AD$2,Input2!Y$330:Y$377)","v":0},{"$f":"SUMIF(Input2!$B$330:$B$377,$AD$2,Input2!Z$330:Z$377)","v":0},{"$f":"SUMIF(Input2!$B$330:$B$377,$AD$2,Input2!AA$330:AA$377)","v":0},{"$f":"SUMIF(Input2!$B$330:$B$377,$AD$2,Input2!AB$330:AB$377)","v":0},{"$f":"SUMIF(Input2!$B$330:$B$377,$AD$2,Input2!AC$330:AC$377)","v":0},{"$f":"SUMIF(Input2!$B$330:$B$377,$AD$2,Input2!AD$330:AD$377)","v":0},{"$f":"SUMIF(Input2!$B$330:$B$377,$AD$2,Input2!AE$330:AE$377)","v":0},{"$f":"SUMIF(Input2!$B$330:$B$377,$AD$2,Input2!AF$330:AF$377)","v":0},{"$f":"SUMIF(Input2!$B$330:$B$377,$AD$2,Input2!AG$330:AG$377)","v":0},{"$f":"SUMPRODUCT((Input2!$B$330:$B$377=$AD$2)*Input2!AH$330:AK$377)","v":0},0,{"$f":"SUMIFS(Input2!C$330:C$377,Input2!AL$330:AL$377,\">0\",Input2!B$330:B$377,\"S\")","v":0},{"$f":"IFERROR(SUMPRODUCT((Input2!B$330:B$377=\"S\")*Input2!C$330:C$377*Input2!AL$330:AL$377)/R72,0)","v":0},{"$f":"SUMIF(Input2!$B$330:$B$377,$AD$2,Input2!D$330:D$377)","v":0},{"$f":"SUMIF(Input2!$B$330:$B$377,$AD$2,Input2!E$330:E$377)","v":0},{"$f":"SUMIF(Input2!$B$330:$B$377,$AD$2,Input2!F$330:F$377)","v":0},{"$f":"SUMIF(Input2!$B$330:$B$377,$AD$2,Input2!G$330:G$377)","v":0},{"$f":"SUMIF(Input2!$B$330:$B$377,$AD$2,Input2!H$330:H$377)","v":0},{"$f":"SUMIF(Input2!$B$330:$B$377,$AD$2,Input2!I$330:I$377)","v":0},{"$f":"SUMIF(Input2!$B$330:$B$377,$AD$2,Input2!J$330:J$377)","v":0},{"$f":"SUMIF(Input2!$B$330:$B$377,$AD$2,Input2!K$330:K$377)","v":0},{"$f":"SUMIF(Input2!$B$330:$B$377,$AD$2,Input2!L$330:L$377)","v":0},{"$f":"SUMIF(Input2!$B$330:$B$377,$AD$2,Input2!M$330:M$377)","v":0},{"$f":"SUMIF(Input2!$B$330:$B$377,$AD$2,Input2!N$330:N$377)","v":0},{"$f":"SUMIF(Input2!$B$330:$B$377,$AD$2,Input2!O$330:O$377)","v":0},{"$f":"SUMIF(Input2!$B$330:$B$377,$AD$2,Input2!P$330:P$377)","v":0},{"$f":"SUMIF(Input2!$B$330:$B$377,$AD$2,Input2!Q$330:Q$377)","v":0},0,0]
[null,{"$f":"IFERROR(DATEVALUE(RIGHT(Input2!$A$388,LEN(Input2!$A$388)-FIND(\",\",Input2!$A$388)-1)),7)","v":"1900-01-07"},6,{"$f":"SUMIF(Input2!$B$393:$B$440,$AD$2,Input2!V$393:V$440)","v":0},{"$f":"SUMIF(Input2!$B$393:$B$440,$AD$2,Input2!W$393:W$440)","v":0},{"$f":"SUMIF(Input2!$B$393:$B$440,$AD$2,Input2!X$393:X$440)","v":0},{"$f":"SUMIF(Input2!$B$393:$B$440,$AD$2,Input2!Y$393:Y$440)","v":0},{"$f":"SUMIF(Input2!$B$393:$B$440,$AD$2,Input2!Z$393:Z$440)","v":0},{"$f":"SUMIF(Input2!$B$393:$B$440,$AD$2,Input2!AA$393:AA$440)","v":0},{"$f":"SUMIF(Input2!$B$393:$B$440,$AD$2,Input2!AB$393:AB$440)","v":0},{"$f":"SUMIF(Input2!$B$393:$B$440,$AD$2,Input2!AC$393:AC$440)","v":0},{"$f":"SUMIF(Input2!$B$393:$B$440,$AD$2,Input2!AD$393:AD$440)","v":0},{"$f":"SUMIF(Input2!$B$393:$B$440,$AD$2,Input2!AE$393:AE$440)","v":0},{"$f":"SUMIF(Input2!$B$393:$B$440,$AD$2,Input2!AF$393:AF$440)","v":0},{"$f":"SUMIF(Input2!$B$393:$B$440,$AD$2,Input2!AG$393:AG$440)","v":0},{"$f":"SUMPRODUCT((Input2!$B$393:$B$440=$AD$2)*Input2!AH$393:AK$440)","v":0},0,{"$f":"SUMIFS(Input2!C$393:C$440,Input2!AL$393:AL$440,\">0\",Input2!B$393:B$440,\"S\")","v":0},{"$f":"IFERROR(SUMPRODUCT((Input2!B$393:B$440=\"S\")*Input2!C$393:C$440*Input2!AL$393:AL$440)/R73,0)","v":0},{"$f":"SUMIF(Input2!$B$393:$B$440,$AD$2,Input2!D$393:D$440)","v":0},{"$f":"SUMIF(Input2!$B$393:$B$440,$AD$2,Input2!E$393:E$440)","v":0},{"$f":"SUMIF(Input2!$B$393:$B$440,$AD$2,Input2!F$393:F$440)","v":0},{"$f":"SUMIF(Input2!$B$393:$B$440,$AD$2,Input2!G$393:G$440)","v":0},{"$f":"SUMIF(Input2!$B$393:$B$440,$AD$2,Input2!H$393:H$440)","v":0},{"$f":"SUMIF(Input2!$B$393:$B$440,$AD$2,Input2!I$393:I$440)","v":0},{"$f":"SUMIF(Input2!$B$393:$B$440,$AD$2,Input2!J$393:J$440)","v":0},{"$f":"SUMIF(Input2!$B$393:$B$440,$AD$2,Input2!K$393:K$440)","v":0},{"$f":"SUMIF(Input2!$B$393:$B$440,$AD$2,Input2!L$393:L$440)","v":0},{"$f":"SUMIF(Input2!$B$393:$B$440,$AD$2,Input2!M$393:M$440)","v":0},{"$f":"SUMIF(Input2!$B$393:$B$440,$AD$2,Input2!N$393:N$440)","v":0},{"$f":"SUMIF(Input2!$B$393:$B$440,$AD$2,Input2!O$393:O$440)","v":0},{"$f":"SUMIF(Input2!$B$393:$B$440,$AD$2,Input2!P$393:P$440)","v":0},{"$f":"SUMIF(Input2!$B$393:$B$440,$AD$2,Input2!Q$393:Q$440)","v":0},0,0]
[null,"Total",null,{"$f":"SUM(D67:D73)","v":0},0,0,0,0,0,0,0,0,0,0,0,0,0,0,{"$f":"IFERROR(SUMPRODUCT(R67:R73,S67:S73)/R74,0)","v":0},{"$f":"SUM(T67:T73)","v":0},0,0,0,0,0,0,0,0,0,0,0,0,0,0,0]
[]
[null,{"$f":"\"Direction 2/Both Lanes : Towards \"&Input!B5","v":"Direction 2/Both Lanes : Towards DUNCANSBY RD"}]
[null,null,null,"Summary of Speed Classification",null,null,null,null,null,null,null,null,null,null,null,null,null,null,null,"Summary of Vehicle Classification"]
[null,"Date",null,"<10","10-20","20-30","30-40","40-50","50-60","60-70","70-80","80-90","90-100","100-110","110-120","121+","Daily","85th Percentile",null,"CL1","CL2","CL3","CL4","CL5","CL6","CL7","CL8","CL9","CL10","CL11","CL12","CL13","CL14","Daily","%HCV"]
[null,{"$f":"IFERROR(TEXT(B80,\"MMMM\"),0)","v":"January"},"Day",null,null,null,null,null,null,null,null,null,null,null,null,null,"Total","Total","Speed",null,null,null,null,null,null,null,null,null,null,null,null,null,null,"Total"]
[null,{"$f":"IFERROR(DATEVALUE(RIGHT(Input2!$A$10,LEN(Input2!$A$10)-FIND(\",\",Input2!$A$10)-1)),1)","v":"1900-01-01"},{"$f":"IFERROR(WEEKDAY(B80,2),0)","v":7},{"$f":"D54+D67","v":0},0,0,0,0,0,0,0,0,0,0,0,0,{"$f":"SUM(D80:P80)","v":0},{"$f":"SUMIF(Input2!AL$15:AL$62,\">0\",Input2!C$15:C$62)","v":0},{"$f":"IFERROR(SUMPRODUCT(Input2!C$15:C$62*Input2!AL$15:AL$62)/R80,0)","v":0},{"$f":"T54+T67","v":0},0,0,0,0,0,0,0,0,0,0,0,0,0,{"$f":"SUM(T80:AG80)","v":0},{"$f":"IFERROR(SUM(W80:AF80)/AH80,0)","v":0}]
[null,{"$f":"IFERROR(DATEVALUE(RIGHT(Input2!$A$73,LEN(Input2!$A$73)-FIND(\",\",Input2!$A$73)-1)),2)","v":"1900-01-02"},1,0,0,0,0,0,0,0,0,0,0,0,0,0,0,{"$f":"SUMIF(Input2!AL$78:AL$125,\">0\",Input2!C$78:C$125)","v":0},{"$f":"IFERROR(SUMPRODUCT(Input2!C$78:C$125*Input2!AL$78:AL$125)/R81,0)","v":0},0,0,0,0,0,0,0,0,0,0,0,0,0,0,0,0]
[null,{"$f":"IFERROR(DATEVALUE(RIGHT(Input2!$A$136,LEN(Input2!$A$136)-FIND(\",\",Input2!$A$136)-1)),3)","v":"1900-01-03"},2,0,0,0,0,0,0,0,0,0,0,0,0,0,0,{"$f":"SUMIF(Input2!AL$141:AL$188,\">0\",Input2!C$141:C$188)","v":0},{"$f":"IFERROR(SUMPRODUCT(Input2!C$141:C$188*Input2!AL$141:AL$188)/R82,0)","v":0},0,0,0,0,0,0,0,0,0,0,0,0,0,0,0,0]
[null,{"$f":"IFERROR(DATEVALUE(RIGHT(Input2!$A$199,LEN(Input2!$A$199)-FIND(\",\",Input2!$A$199)-1)),4)","v":"1900-01-04"},3,0,0,0,0,0,0,0,0,0,0,0,0,0,0,{"$f":"SUMIF(Input2!AL$204:AL$251,\">0\",Input2!C$204:C$251)","v":0},{"$f":"IFERROR(SUMPRODUCT(Input2!C$204:C$251*Input2!AL$204:AL$251)/R83,0)","v":0},0,0,0,0,0,0,0,0,0,0,0,0,0,0,0,0]
[null,{"$f":"IFERROR(DATEVALUE(RIGHT(Input2!$A$262,LEN(Input2!$A$262)-FIND(\",\",Input2!$A$262)-1)),5)","v":"1900-01-05"},4,0,0,0,0,0,0,0,0,0,0,0,0,0,0,{"$f":"SUMIF(Input2!AL$267:AL$314,\">0\",Input2!C$267:C$314)","v":0},{"$f":"IFERROR(SUMPRODUCT(Input2!C$267:C$314*Input2!AL$267:AL$314)/R84,0)","v":0},0,0,0,0,0,0,0,0,0,0,0,0,0,0,0,0]
[null,{"$f":"IFERROR(DATEVALUE(RIGHT(Input2!$A$325,LEN(Input2!$A$325)-FIND(\",\",Input2!$A$325)-1)),6)","v":"1900-01-06"},5,0,0,0,0,0,0,0,0,0,0,0,0,0,0,{"$f":"SUMIF(Input2!AL$330:AL$377,\">0\",Input2!C$330:C$377)","v":0},{"$f":"IFERROR(SUMPRODUCT(Input2!C$330:C$377*Input2!AL$330:AL$377)/R85,0)","v":0},0,0,0,0,0,0,0,0,0,0,0,0,0,0,0,0]
[null,{"$f":"IFERROR(DATEVALUE(RIGHT(Input2!$A$388,LEN(Input2!$A$388)-FIND(\",\",Input2!$A$388)-1)),7)","v":"1900-01-07"},6,0,0,0,0,0,0,0,0,0,0,0,0,0,0,{"$f":"SUMIF(Input2!AL$393:AL$440,\">0\",Input2!C$393:C$440)","v":0},{"$f":"IFERROR(SUMPRODUCT(Input2!C$393:C$440*Input2!AL$393:AL$440)/R86,0)","v":0},0,0,0,0,0,0,0,0,0,0,0,0,0,0,0,0]
[null,"Total",null,{"$f":"SUM(D80:D86)","v":0},0,0,0,0,0,0,0,0,0,0,0,0,0,0,{"$f":"IFERROR(SUMPRODUCT(R80:R86,S80:S86)/R87,0)","v":0},{"$f":"SUM(T80:T86)","v":0},0,0,0,0,0,0,0,0,0,0,0,0,0,0,0]
[]
[null,"Both Directions/Both Lanes"]
[null,null,null,"Summary of Speed Classification",null,null,null,null,null,null,null,null,null,null,null,null,null,null,null,"Summary of Vehicle Classification"]
[null,"Date",null,"<10","10-20","20-30","30-40","40-50","50-60","60-70","70-80","80-90","90-100","100-110","110-120","121+","Daily","85th Percentile",null,"CL1","CL2","CL3","CL4","CL5","CL6","CL7","CL8","CL9","CL10","CL11","CL12","CL13","CL14","Daily","%HCV"]
[null,{"$f":"IFERROR(TEXT(B93,\"MMMM\"),0)","v":"October"},"Day",null,null,null,null,null,null,null,null,null,null,null,null,null,"Total","Total","Speed",null,null,null,null,null,null,null,null,null,null,null,null,null,null,"Total"]
[null,{"$f":"IFERROR(DATEVALUE(RIGHT(Input!$A$10,LEN(Input!$A$10)-FIND(\",\",Input!$A$10)-1)),1)","v":"2024-10-30"},{"$f":"IFERROR(WEEKDAY(B93,2),0)","v":3},{"$f":"D41+D80","v":0},{"$f":"E41+E80","v":14},268,1284,6796,1475,65,7,0,0,0,1,1,{"$f":"SUM(D93:P93)","v":9911},{"$f":"R41+R80","v":9888},{"$f":"IFERROR((R41*S41+R80*S80)/R93,0)","v":49.775930420711987},{"$f":"T41+T80","v":47},9521,46,104,160,8,17,5,1,0,0,0,0,2,{"$f":"SUM(T93:AG93)","v":9911},{"$f":"IFERROR(SUM(W93:AF93)/AH93,0)","v":2.9764907678337203E-2}]
[null,{"$f":"IFERROR(DATEVALUE(RIGHT(Input!$A$73,LEN(Input!$A$73)-FIND(\",\",Input!$A$73)-1)),2)","v":"2024-10-31"},4,{"$f":"D42+D81","v":0},17,270,1306,6979,1705,67,6,4,2,1,0,0,10357,{"$f":"R42+R81","v":10309},{"$f":"IFERROR((R42*S42+R81*S81)/R94,0)","v":50.042836356581624},{"$f":"T42+T81","v":72},9938,90,110,119,9,11,3,1,1,0,0,0,3,10357,2.452447619967172E-2]
[null,{"$f":"IFERROR(DATEVALUE(RIGHT(Input!$A$136,LEN(Input!$A$136)-FIND(\",\",Input!$A$136)-1)),3)","v":"2024-11-01"},5,0,20,255,1225,6836,1698,73,6,1,0,0,0,0,10114,10069,50.109057503227731,{"$f":"T43+T82","v":91},9675,83,120,116,11,10,3,1,0,0,0,1,3,10114,2.5904686573067034E-2]
[null,{"$f":"IFERROR(DATEVALUE(RIGHT(Input!$A$199,LEN(Input!$A$199)-FIND(\",\",Input!$A$199)-1)),4)","v":"2024-11-02"},6,0,20,234,998,4919,1254,64,13,1,2,0,0,0,7505,7461,50.20388687843451,{"$f":"T44+T83","v":86},7164,86,67,79,8,10,1,0,0,0,0,0,4,7505,2.1985343104596936E-2]
[null,{"$f":"IFERROR(DATEVALUE(RIGHT(Input!$A$262,LEN(Input!$A$262)-FIND(\",\",Input!$A$262)-1)),5)","v":"2024-11-03"},7,0,9,208,914,4368,1140,55,9,2,0,0,0,3,6708,6661,50.318150427863678,{"$f":"T45+T84","v":87},6433,60,50,61,8,6,2,0,0,0,0,0,1,6708,1.8932617769827072E-2]
[null,{"$f":"IFERROR(DATEVALUE(RIGHT(Input!$A$325,LEN(Input!$A$325)-FIND(\",\",Input!$A$325)-1)),6)","v":"2024-11-04"},1,0,15,255,1246,6535,1579,51,6,4,1,2,0,0,9694,9664,49.931332781456959,{"$f":"T46+T85","v":72},9269,100,109,112,9,13,2,1,0,0,0,0,7,9694,2.5376521559727666E-2]
[null,{"$f":"IFERROR(DATEVALUE(RIGHT(Input!$A$388,LEN(Input!$A$388)-FIND(\",\",Input!$A$388)-1)),7)","v":"2024-11-05"},2,0,10,253,1227,6595,1583,58,7,4,1,0,1,0,9739,9689,49.772329445763241,{"$f":"T47+T86","v":96},9350,62,116,91,4,8,3,2,1,0,1,1,4,9739,2.3308347879659103E-2]
[null,"Total",null,{"$f":"SUM(D93:D99)","v":0},105,1743,8200,43028,10434,433,54,16,6,3,2,4,64028,63741,{"$f":"IFERROR(SUMPRODUCT(R93:R99,S93:S99)/R100,0)","v":50.001490406488756},{"$f":"SUM(T93:T99)","v":551},61350,527,676,738,57,75,19,6,2,0,1,2,24,64028,2.4614231273817705E-2]
[]
[null,"SUMMARY OF 7DAYS DATA"]
[]
[null,{"$f":"IF(Input2!A1=\"\",\"Direction 1: Towards \"&Input!B6,\"Direction 1/Lane 1 : Towards \"&Input!B6)","v":"Direction 1: Towards COOPER RD"}]
[null,"   Posted Speed",null,null,null,null,{"$f":"$Q$7","v":"50 "},"kph",null,null,"5/Day (Av)   =",null,null,null,null,null,{"$f":"SUMPRODUCT((C15:C21<6)*Q15:Q21)/5","v":4473},null,null,"Cars & LCV =",null,null,{"$f":"IFERROR(SUM(T22:V22)/$AH$22*100,0)","v":96.597241571468373},"%"]
[null,"   Vehicles Exceeding Posted Speed",null,null,null,null,{"$f":"SUM(OFFSET(D22,0,G105/10):P22)","v":9106},null,null,null,"7/Day (Av)   =",null,null,null,null,null,{"$f":"AVERAGE(Q15:Q21)","v":4101.7142857142853},null,null,"MCV =",null,null,{"$f":"IFERROR(W22/$AH$22*100,0)","v":0.95430482028420172},"%"]
[null,"   Percentage Exceeding Posted Speed",null,null,null,null,{"$f":"IFERROR(G106/Q22*100,0)","v":31.714962385065476},"%",null,null,"Saturday =",null,null,null,null,null,{"$f":"SUMPRODUCT((C15:C21=6)*Q15:Q21)","v":3290},null,null,"HCV1 =",null,null,{"$f":"IFERROR(SUM(X22:Z22)/$AH$22*100,0)","v":2.3300362217887991},"%"]
[null,"   85th Percentile Speed",null,null,null,null,{"$f":"S22","v":52.893543753941003},"kph",null,null,"Sunday =",null,null,null,null,null,{"$f":"SUMPRODUCT((C15:C21=7)*Q15:Q21)","v":3057},null,null,"HCV2 =",null,null,{"$f":"IFERROR(SUM(AA22:AF22)/$AH$22*100,0)","v":8.0105879074951244E-2},"%"]
[null,null,null,null,null,null,null,null,null,null,"Total Vehicles Surveyed",null,null,null,null,null,{"$f":"Q22","v":28712},null,null,"Total HCV =",null,null,{"$f":"IFERROR(SUM(W106:W108),0)","v":3.3644469211479517},"%"]
[null,{"$f":"IF(Input2!A1=\"\",\"Direction 2: Towards \"&Input!B5,\"Direction 1/Lane 2 : Towards \"&Input!B6)","v":"Direction 2: Towards DUNCANSBY RD"}]
[null,"   Posted Speed",null,null,null,null,{"$f":"$Q$7","v":"50 "},"kph",null,null,"5/Day (Av)   =",null,null,null,null,null,{"$f":"SUMPRODUCT((C28:C34<6)*Q28:Q34)/5","v":5490},null,null,"Cars & LCV =",null,null,{"$f":"IFERROR(SUM(T35:V35)/$AH$35*100,0)","v":98.235927058557024},"%"]
[null,"   Vehicles Exceeding Posted Speed",null,null,null,null,{"$f":"SUM(OFFSET(D35,0,G111/10):P35)","v":1846},null,null,null,"7/Day (Av)   =",null,null,null,null,null,{"$f":"AVERAGE(Q28:Q34)","v":5045.1428571428569},null,null,"MCV =",null,null,{"$f":"IFERROR(W35/$AH$35*100,0)","v":1.1382942575603126},"%"]
[null,"   Percentage Exceeding Posted Speed",null,null,null,null,{"$f":"IFERROR(G112/Q35*100,0)","v":5.2270925359610372},"%",null,null,"Saturday =",null,null,null,null,null,{"$f":"SUMPRODUCT((C28:C34=6)*Q28:Q34)","v":4215},null,null,"HCV1 =",null,null,{"$f":"IFERROR(SUM(X35:Z35)/$AH$35*100,0)","v":0.56914712878015628},"%"]
[null,"   85th Percentile Speed",null,null,null,null,{"$f":"S35","v":47.67069974988631},"kph",null,null,"Sunday =",null,null,null,null,null,{"$f":"SUMPRODUCT((C28:C34=7)*Q28:Q34)","v":3651},null,null,"HCV2 =",null,null,{"$f":"IFERROR(SUM(AA35:AF35)/$AH$35*100,0)","v":1.982104428587609E-2},"%"]
[null,null,null,null,null,null,null,null,null,null,"Total Vehicles Surveyed",null,null,null,null,null,{"$f":"Q35","v":35316},null,null,"Total HCV =",null,null,{"$f":"IFERROR(SUM(W112:W114),0)","v":1.7272624306263449},"%"]
[null,{"$f":"IF(Input2!A1=\"\",\"Both Directions\",\"Direction 1/Both Lanes : Towards \"&Input!B6)","v":"Both Directions"}]
[null,"   Posted Speed",null,null,null,null,{"$f":"$Q$7","v":"50 "},"kph",null,null,"5/Day (Av)   =",null,null,null,null,null,{"$f":"Q105+Q111","v":9963},null,null,"Cars & LCV =",null,null,{"$f":"IFERROR(SUM(T48:V48)/$AH$48*100,0)","v":97.501093271693634},"%"]
[null,"   Vehicles Exceeding Posted Speed",null,null,null,null,{"$f":"SUM(OFFSET(D48,0,G117/10):P48)","v":10952},null,null,null,"7/Day (Av)   =",null,null,null,null,null,{"$f":"Q106+Q112","v":9146.8571428571413},null,null,"MCV =",null,null,{"$f":"IFERROR(W48/$AH$48*100,0)","v":1.0557880927094396},"%"]
[null,"   Percentage Exceeding Posted Speed",null,null,null,null,{"$f":"IFERROR(G118/Q48*100,0)","v":17.105016555257073},"%",null,null,"Saturday =",null,null,null,null,null,7505,null,null,"HCV1 =",null,null,{"$f":"IFERROR(SUM(X48:Z48)/$AH$48*100,0)","v":1.3587805335165866},"%"]
[null,"   85th Percentile Speed",null,null,null,null,{"$f":"S48","v":50.001490406488756},"kph",null,null,"Sunday =",null,null,null,null,null,6708,null,null,"HCV2 =",null,null,{"$f":"IFERROR(SUM(AA48:AF48)/$AH$48*100,0)","v":4.6854501155744362E-2},"%"]
[null,null,null,null,null,null,null,null,null,null,"Total Vehicles Surveyed",null,null,null,null,null,64028,null,null,"Total HCV =",null,null,{"$f":"IFERROR(SUM(W118:W120),0)","v":2.4614231273817704},"%"]
[]
[null,{"$f":"\"Direction 2/Lane 1 : Towards \"&Input!B5","v":"Direction 2/Lane 1 : Towards DUNCANSBY RD"}]
[null,"   Posted Speed",null,null,null,null,{"$f":"$Q$7","v":"50 "},"kph",null,null,"5/Day (Av)   =",null,null,null,null,null,{"$f":"SUMPRODUCT((C54:C60<6)*Q54:Q60)/5","v":0},null,null,"Cars & LCV =",null,null,{"$f":"IFERROR(SUM(T61:V61)/$AH$61*100,0)","v":0},"%"]
[null,"   Vehicles Exceeding Posted Speed",null,null,null,null,{"$f":"SUM(OFFSET(D61,0,G124/10):P61)","v":0},null,null,null,"7/Day (Av)   =",null,null,null,null,null,{"$f":"AVERAGE(Q54:Q60)","v":0},null,null,"MCV =",null,null,{"$f":"IFERROR(W61/$AH$61*100,0)","v":0},"%"]
[null,"   Percentage Exceeding Posted Speed",null,null,null,null,{"$f":"IFERROR(G125/Q61*100,0)","v":0},"%",null,null,"Saturday =",null,null,null,null,null,{"$f":"SUMPRODUCT((C54:C60=6)*Q54:Q60)","v":0},null,null,"HCV1 =",null,null,{"$f":"IFERROR(SUM(X61:Z61)/$AH$61*100,0)","v":0},"%"]
[null,"   85th Percentile Speed",null,null,null,null,{"$f":"S61","v":0},"kph",null,null,"Sunday =",null,null,null,null,null,{"$f":"SUMPRODUCT((C54:C60=7)*Q54:Q60)","v":0},null,null,"HCV2 =",null,null,{"$f":"IFERROR(SUM(AA61:AF61)/$AH$61*100,0)","v":0},"%"]
[null,null,null,null,null,null,null,null,null,null,"Total Vehicles Surveyed",null,null,null,null,null,{"$f":"Q61","v":0},null,null,"Total HCV =",null,null,{"$f":"IFERROR(SUM(W125:W127),0)","v":0},"%"]
[null,{"$f":"\"Direction 2/Lane 2 : Towards \"&Input!B5","v":"Direction 2/Lane 2 : Towards DUNCANSBY RD"}]
[null,"   Posted Speed",null,null,null,null,{"$f":"$Q$7","v":"50 "},"kph",null,null,"5/Day (Av)   =",null,null,null,null,null,{"$f":"SUMPRODUCT((C67:C73<6)*Q67:Q73)/5","v":0},null,null,"Cars & LCV =",null,null,{"$f":"IFERROR(SUM(T74:V74)/$AH$74*100,0)","v":0},"%"]
[null,"   Vehicles Exceeding Posted Speed",null,null,null,null,{"$f":"SUM(OFFSET(D74,0,G130/10):P74)","v":0},null,null,null,"7/Day (Av)   =",null,null,null,null,null,{"$f":"AVERAGE(Q67:Q73)","v":0},null,null,"MCV =",null,null,{"$f":"IFERROR(W74/$AH$74*100,0)","v":0},"%"]
[null,"   Percentage Exceeding Posted Speed",null,null,null,null,{"$f":"IFERROR(G131/Q74*100,0)","v":0},"%",null,null,"Saturday =",null,null,null,null,null,{"$f":"SUMPRODUCT((C67:C73=6)*Q67:Q73)","v":0},null,null,"HCV1 =",null,null,{"$f":"IFERROR(SUM(X74:Z74)/$AH$74*100,0)","v":0},"%"]
[null,"   85th Percentile Speed",null,null,null,null,{"$f":"S74","v":0},"kph",null,null,"Sunday =",null,null,null,null,null,{"$f":"SUMPRODUCT((C67:C73=7)*Q67:Q73)","v":0},null,null,"HCV2 =",null,null,{"$f":"IFERROR(SUM(AA74:AF74)/$AH$74*100,0)","v":0},"%"]
[null,null,null,null,null,null,null,null,null,null,"Total Vehicles Surveyed",null,null,null,null,null,{"$f":"Q74","v":0},null,null,"Total HCV =",null,null,{"$f":"IFERROR(SUM(W131:W133),0)","v":0},"%"]
[null,{"$f":"\"Direction 2/Both Lanes : Towards \"&Input!B5","v":"Direction 2/Both Lanes : Towards DUNCANSBY RD"}]
[null,"   Posted Speed",null,null,null,null,{"$f":"$Q$7","v":"50 "},"kph",null,null,"5/Day (Av)   =",null,null,null,null,null,{"$f":"Q124+Q130","v":0},null,null,"Cars & LCV =",null,null,{"$f":"IFERROR(SUM(T87:V87)/$AH$87*100,0)","v":0},"%"]
[null,"   Vehicles Exceeding Posted Speed",null,null,null,null,{"$f":"SUM(OFFSET(D87,0,G136/10):P87)","v":0},null,null,null,"7/Day (Av)   =",null,null,null,null,null,{"$f":"Q125+Q131","v":0},null,null,"MCV =",null,null,{"$f":"IFERROR(W87/$AH$87*100,0)","v":0},"%"]
[null,"   Percentage Exceeding Posted Speed",null,null,null,null,{"$f":"IFERROR(G137/Q87*100,0)","v":0},"%",null,null,"Saturday =",null,null,null,null,null,0,null,null,"HCV1 =",null,null,{"$f":"IFERROR(SUM(X87:Z87)/$AH$87*100,0)","v":0},"%"]
[null,"   85th Percentile Speed",null,null,null,null,{"$f":"S87","v":0},"kph",null,null,"Sunday =",null,null,null,null,null,0,null,null,"HCV2 =",null,null,{"$f":"IFERROR(SUM(AA87:AF87)/$AH$87*100,0)","v":0},"%"]
[null,null,null,null,null,null,null,null,null,null,"Total Vehicles Surveyed",null,null,null,null,null,0,null,null,"Total HCV =",null,null,{"$f":"IFERROR(SUM(W137:W139),0)","v":0},"%"]
[]
[null,"Both Directions /Both Lanes "]
[null,"   Posted Speed",null,null,null,null,{"$f":"$Q$7","v":"50 "},"kph",null,null,"5/Day (Av)   =",null,null,null,null,null,{"$f":"Q117+Q136","v":9963},null,null,"Cars & LCV =",null,null,{"$f":"IFERROR(SUM(T100:V100)/$AH$100*100,0)","v":97.501093271693634},"%"]
[null,"   Vehicles Exceeding Posted Speed",null,null,null,null,{"$f":"SUM(OFFSET(D100,0,G143/10):P100)","v":10952},null,null,null,"7/Day (Av)   =",null,null,null,null,null,{"$f":"Q118+Q137","v":9146.8571428571413},null,null,"MCV =",null,null,{"$f":"IFERROR(W100/$AH$100*100,0)","v":1.0557880927094396},"%"]
[null,"   Percentage Exceeding Posted Speed",null,null,null,null,{"$f":"IFERROR(G144/Q100*100,0)","v":17.105016555257073},"%",null,null,"Saturday =",null,null,null,null,null,{"$f":"Q119+Q138","v":7505},null,null,"HCV1 =",null,null,{"$f":"IFERROR(SUM(X100:Z100)/$AH$100*100,0)","v":1.3587805335165866},"%"]
[null,"   85th Percentile Speed",null,null,null,null,{"$f":"S100","v":50.001490406488756},"kph",null,null,"Sunday =",null,null,null,null,null,{"$f":"Q120+Q139","v":6708},null,null,"HCV2 =",null,null,{"$f":"IFERROR(SUM(AA100:AF100)/$AH$100*100,0)","v":4.6854501155744362E-2},"%"]
[null,null,null,null,null,null,null,null,null,null,"Total Vehicles Surveyed",null,null,null,null,null,{"$f":"Q121+Q140","v":64028},null,null,"Total HCV =",null,null,{"$f":"IFERROR(SUM(W144:W146),0)","v":2.4614231273817704},"%"]
[]
[]
[null,"Peaks Summary",null,null,"Direction 1",null,null,null,null,null,null,"Direction 2"]
[null,null,null,null,{"$f":"LEFT(Input!$A$10,3)","v":"Wed"},{"$f":"LEFT(Input!$A$73,3)","v":"Thu"},{"$f":"LEFT(Input!$A$136,3)","v":"Fri"},{"$f":"LEFT(Input!$A$199,3)","v":"Sat"},{"$f":"LEFT(Input!$A$262,3)","v":"Sun"},{"$f":"LEFT(Input!$A$325,3)","v":"Mon"},{"$f":"LEFT(Input!$A$388,3)","v":"Tue"},{"$f":"LEFT(Input!$A$10,3)","v":"Wed"},{"$f":"LEFT(Input!$A$73,3)","v":"Thu"},{"$f":"LEFT(Input!$A$136,3)","v":"Fri"},{"$f":"LEFT(Input!$A$199,3)","v":"Sat"},{"$f":"LEFT(Input!$A$262,3)","v":"Sun"},{"$f":"LEFT(Input!$A$325,3)","v":"Mon"},{"$f":"LEFT(Input!$A$388,3)","v":"Tue"}]
[null,"AM PEAK"]
[null,"   60 Minutes beginning",null,null,{"$f":"OFFSET(Peaks!$C$3,MATCH(E154,Peaks!E4:E19,0),0)","v":"0800"},{"$f":"OFFSET(Peaks!$C$3,MATCH(F154,Peaks!F4:F19,0),0)","v":"0800"},{"$f":"OFFSET(Peaks!$C$3,MATCH(G154,Peaks!G4:G19,0),0)","v":"0800"},{"$f":"OFFSET(Peaks!$C$3,MATCH(H154,Peaks!H4:H19,0),0)","v":"0900"},{"$f":"OFFSET(Peaks!$C$3,MATCH(I154,Peaks!I4:I19,0),0)","v":"0900"},{"$f":"OFFSET(Peaks!$C$3,MATCH(J154,Peaks!J4:J19,0),0)","v":"0815"},{"$f":"OFFSET(Peaks!$C$3,MATCH(K154,Peaks!K4:K19,0),0)","v":"0815"},{"$f":"OFFSET(Peaks!$C$3,MATCH(L154,Peaks!M4:M19,0),0)","v":"0800"},{"$f":"OFFSET(Peaks!$C$3,MATCH(M154,Peaks!N4:N19,0),0)","v":"0800"},{"$f":"OFFSET(Peaks!$C$3,MATCH(N154,Peaks!O4:O19,0),0)","v":"0800"},{"$f":"OFFSET(Peaks!$C$3,MATCH(O154,Peaks!P4:P19,0),0)","v":"0900"},{"$f":"OFFSET(Peaks!$C$3,MATCH(P154,Peaks!Q4:Q19,0),0)","v":"0900"},{"$f":"OFFSET(Peaks!$C$3,MATCH(Q154,Peaks!R4:R19,0),0)","v":"0800"},{"$f":"OFFSET(Peaks!$C$3,MATCH(R154,Peaks!S4:S19,0),0)","v":"0800"}]
[null,"   Volume",null,null,{"$f":"MAX(Peaks!E3:E20)","v":223},{"$f":"MAX(Peaks!F3:F20)","v":236},{"$f":"MAX(Peaks!G3:G20)","v":225},{"$f":"MAX(Peaks!H3:H20)","v":159},{"$f":"MAX(Peaks!I3:I20)","v":151},{"$f":"MAX(Peaks!J3:J20)","v":224},{"$f":"MAX(Peaks!K3:K20)","v":229},{"$f":"MAX(Peaks!M3:M20)","v":656},{"$f":"MAX(Peaks!N3:N20)","v":716},{"$f":"MAX(Peaks!O3:O20)","v":709},{"$f":"MAX(Peaks!P3:P20)","v":401},{"$f":"MAX(Peaks!Q3:Q20)","v":350},{"$f":"MAX(Peaks!R3:R20)","v":642},{"$f":"MAX(Peaks!S3:S20)","v":702}]
[null,"MID PEAK"]
[null,"   60 Minutes beginning",null,null,{"$f":"OFFSET(Peaks!$C$20,MATCH(E157,Peaks!E21:E40,0),0)","v":1400},{"$f":"OFFSET(Peaks!$C$20,MATCH(F157,Peaks!F21:F40,0),0)","v":1400},{"$f":"OFFSET(Peaks!$C$20,MATCH(G157,Peaks!G21:G40,0),0)","v":1400},{"$f":"OFFSET(Peaks!$C$20,MATCH(H157,Peaks!H21:H40,0),0)","v":1215},{"$f":"OFFSET(Peaks!$C$20,MATCH(I157,Peaks!I21:I40,0),0)","v":1245},{"$f":"OFFSET(Peaks!$C$20,MATCH(J157,Peaks!J21:J40,0),0)","v":1400},{"$f":"OFFSET(Peaks!$C$20,MATCH(K157,Peaks!K21:K40,0),0)","v":1400},{"$f":"OFFSET(Peaks!$C$20,MATCH(L157,Peaks!M21:M40,0),0)","v":"0915"},{"$f":"OFFSET(Peaks!$C$20,MATCH(M157,Peaks!N21:N40,0),0)","v":"0915"},{"$f":"OFFSET(Peaks!$C$20,MATCH(N157,Peaks!O21:O40,0),0)","v":"0915"},{"$f":"OFFSET(Peaks!$C$20,MATCH(O157,Peaks!P21:P40,0),0)","v":"0930"},{"$f":"OFFSET(Peaks!$C$20,MATCH(P157,Peaks!Q21:Q40,0),0)","v":1015},{"$f":"OFFSET(Peaks!$C$20,MATCH(Q157,Peaks!R21:R40,0),0)","v":"0915"},{"$f":"OFFSET(Peaks!$C$20,MATCH(R157,Peaks!S21:S40,0),0)","v":"0915"}]
[null,"   Volume",null,null,{"$f":"MAX(Peaks!E20:E41)","v":322},{"$f":"MAX(Peaks!F20:F41)","v":299},{"$f":"MAX(Peaks!G20:G41)","v":407},{"$f":"MAX(Peaks!H20:H41)","v":320},{"$f":"MAX(Peaks!I20:I41)","v":341},{"$f":"MAX(Peaks!J20:J41)","v":322},{"$f":"MAX(Peaks!K20:K41)","v":297},{"$f":"MAX(Peaks!M20:M41)","v":363},{"$f":"MAX(Peaks!N20:N41)","v":397},{"$f":"MAX(Peaks!O20:O41)","v":398},{"$f":"MAX(Peaks!P20:P41)","v":432},{"$f":"MAX(Peaks!Q20:Q41)","v":382},{"$f":"MAX(Peaks!R20:R41)","v":340},{"$f":"MAX(Peaks!S20:S41)","v":363}]
[null,"PM PEAK"]
[null,"   60 Minutes beginning",null,null,{"$f":"OFFSET(Peaks!$C$41,MATCH(E160,Peaks!E42:E60,0),0)","v":1715},{"$f":"OFFSET(Peaks!$C$41,MATCH(F160,Peaks!F42:F60,0),0)","v":1645},{"$f":"OFFSET(Peaks!$C$41,MATCH(G160,Peaks!G42:G60,0),0)","v":1615},{"$f":"OFFSET(Peaks!$C$41,MATCH(H160,Peaks!H42:H60,0),0)","v":1445},{"$f":"OFFSET(Peaks!$C$41,MATCH(I160,Peaks!I42:I60,0),0)","v":1445},{"$f":"OFFSET(Peaks!$C$41,MATCH(J160,Peaks!J42:J60,0),0)","v":1645},{"$f":"OFFSET(Peaks!$C$41,MATCH(K160,Peaks!K42:K60,0),0)","v":1700},{"$f":"OFFSET(Peaks!$C$41,MATCH(L160,Peaks!M42:M60,0),0)","v":1445},{"$f":"OFFSET(Peaks!$C$41,MATCH(M160,Peaks!N42:N60,0),0)","v":1530},{"$f":"OFFSET(Peaks!$C$41,MATCH(N160,Peaks!O42:O60,0),0)","v":1500},{"$f":"OFFSET(Peaks!$C$41,MATCH(O160,Peaks!P42:P60,0),0)","v":1600},{"$f":"OFFSET(Peaks!$C$41,MATCH(P160,Peaks!Q42:Q60,0),0)","v":1445},{"$f":"OFFSET(Peaks!$C$41,MATCH(Q160,Peaks!R42:R60,0),0)","v":1630},{"$f":"OFFSET(Peaks!$C$41,MATCH(R160,Peaks!S42:S60,0),0)","v":1445}]
[null,"   Volume",null,null,{"$f":"MAX(Peaks!E41:E61)","v":656},{"$f":"MAX(Peaks!F41:F61)","v":878},{"$f":"MAX(Peaks!G41:G61)","v":713},{"$f":"MAX(Peaks!H41:H61)","v":343},{"$f":"MAX(Peaks!I41:I61)","v":321},{"$f":"MAX(Peaks!J41:J61)","v":722},{"$f":"MAX(Peaks!K41:K61)","v":721},{"$f":"MAX(Peaks!M41:M61)","v":454},{"$f":"MAX(Peaks!N41:N61)","v":393},{"$f":"MAX(Peaks!O41:O61)","v":403},{"$f":"MAX(Peaks!P41:P61)","v":320},{"$f":"MAX(Peaks!Q41:Q61)","v":293},{"$f":"MAX(Peaks!R41:R61)","v":408},{"$f":"MAX(Peaks!S41:S61)","v":386}]
[null,"AM PEAK"]
[null,"   60 Minutes beginning",null,null,{"$f":"OFFSET(Peaks!$C$3,MATCH(E163,Peaks!U4:U19,0),0)","v":"0800"},{"$f":"OFFSET(Peaks!$C$3,MATCH(F163,Peaks!V4:V19,0),0)","v":"0800"},{"$f":"OFFSET(Peaks!$C$3,MATCH(G163,Peaks!W4:W19,0),0)","v":"0800"},{"$f":"OFFSET(Peaks!$C$3,MATCH(H163,Peaks!X4:X19,0),0)","v":"0900"},{"$f":"OFFSET(Peaks!$C$3,MATCH(I163,Peaks!Y4:Y19,0),0)","v":"0900"},{"$f":"OFFSET(Peaks!$C$3,MATCH(J163,Peaks!Z4:Z19,0),0)","v":"0815"},{"$f":"OFFSET(Peaks!$C$3,MATCH(K163,Peaks!AA4:AA19,0),0)","v":"0815"},{"$f":"OFFSET(Peaks2!$C$3,MATCH(L163,Peaks2!U4:U19,0),0)","v":{"$error":"#N/A"}},{"$f":"OFFSET(Peaks2!$C$3,MATCH(M163,Peaks2!V4:V19,0),0)","v":{"$error":"#N/A"}},{"$f":"OFFSET(Peaks2!$C$3,MATCH(N163,Peaks2!W4:W19,0),0)","v":{"$error":"#N/A"}},{"$f":"OFFSET(Peaks2!$C$3,MATCH(O163,Peaks2!X4:X19,0),0)","v":{"$error":"#N/A"}},{"$f":"OFFSET(Peaks2!$C$3,MATCH(P163,Peaks2!Y4:Y19,0),0)","v":{"$error":"#N/A"}},{"$f":"OFFSET(Peaks2!$C$3,MATCH(Q163,Peaks2!Z4:Z19,0),0)","v":{"$error":"#N/A"}},{"$f":"OFFSET(Peaks2!$C$3,MATCH(R163,Peaks2!AA4:AA19,0),0)","v":{"$error":"#N/A"}}]
[null,"   Volume",null,null,{"$f":"MAX(Peaks!U3:U20)","v":879},{"$f":"MAX(Peaks!V3:V20)","v":952},{"$f":"MAX(Peaks!W3:W20)","v":934},{"$f":"MAX(Peaks!X3:X20)","v":560},{"$f":"MAX(Peaks!Y3:Y20)","v":501},{"$f":"MAX(Peaks!Z3:Z20)","v":864},{"$f":"MAX(Peaks!AA3:AA20)","v":920},{"$f":"MAX(Peaks2!U3:U20)","v":0},{"$f":"MAX(Peaks2!V3:V20)","v":0},{"$f":"MAX(Peaks2!W3:W20)","v":0},{"$f":"MAX(Peaks2!X3:X20)","v":0},{"$f":"MAX(Peaks2!Y3:Y20)","v":0},{"$f":"MAX(Peaks2!Z3:Z20)","v":0},{"$f":"MAX(Peaks2!AA3:AA20)","v":0}]
[null,"MID PEAK"]
[null,"   60 Minutes beginning",null,null,{"$f":"OFFSET(Peaks!$C$20,MATCH(E166,Peaks!U21:U40,0),0)","v":1400},{"$f":"OFFSET(Peaks!$C$20,MATCH(F166,Peaks!V21:V40,0),0)","v":1400},{"$f":"OFFSET(Peaks!$C$20,MATCH(G166,Peaks!W21:W40,0),0)","v":1400},{"$f":"OFFSET(Peaks!$C$20,MATCH(H166,Peaks!X21:X40,0),0)","v":1145},{"$f":"OFFSET(Peaks!$C$20,MATCH(I166,Peaks!Y21:Y40,0),0)","v":1145},{"$f":"OFFSET(Peaks!$C$20,MATCH(J166,Peaks!Z21:Z40,0),0)","v":1400},{"$f":"OFFSET(Peaks!$C$20,MATCH(K166,Peaks!AA21:AA40,0),0)","v":1400},{"$f":"OFFSET(Peaks2!$C$20,MATCH(L166,Peaks2!U21:U40,0),0)","v":{"$error":"#N/A"}},{"$f":"OFFSET(Peaks2!$C$20,MATCH(M166,Peaks2!V21:V40,0),0)","v":{"$error":"#N/A"}},{"$f":"OFFSET(Peaks2!$C$20,MATCH(N166,Peaks2!W21:W40,0),0)","v":{"$error":"#N/A"}},{"$f":"OFFSET(Peaks2!$C$20,MATCH(O166,Peaks2!X21:X40,0),0)","v":{"$error":"#N/A"}},{"$f":"OFFSET(Peaks2!$C$20,MATCH(P166,Peaks2!Y21:Y40,0),0)","v":{"$error":"#N/A"}},{"$f":"OFFSET(Peaks2!$C$20,MATCH(Q166,Peaks2!Z21:Z40,0),0)","v":{"$error":"#N/A"}},{"$f":"OFFSET(Peaks2!$C$20,MATCH(R166,Peaks2!AA21:AA40,0),0)","v":{"$error":"#N/A"}}]
[null,"   Volume",null,null,{"$f":"MAX(Peaks!U20:U41)","v":652},{"$f":"MAX(Peaks!V20:V41)","v":575},{"$f":"MAX(Peaks!W20:W41)","v":698},{"$f":"MAX(Peaks!X20:X41)","v":682},{"$f":"MAX(Peaks!Y20:Y41)","v":668},{"$f":"MAX(Peaks!Z20:Z41)","v":604},{"$f":"MAX(Peaks!AA20:AA41)","v":574},{"$f":"MAX(Peaks2!U20:U41)","v":0},{"$f":"MAX(Peaks2!V20:V41)","v":0},{"$f":"MAX(Peaks2!W20:W41)","v":0},{"$f":"MAX(Peaks2!X20:X41)","v":0},{"$f":"MAX(Peaks2!Y20:Y41)","v":0},{"$f":"MAX(Peaks2!Z20:Z41)","v":0},{"$f":"MAX(Peaks2!AA20:AA41)","v":0}]
[null,"PM PEAK"]
[null,"   60 Minutes beginning",null,null,{"$f":"OFFSET(Peaks!$C$41,MATCH(E169,Peaks!U42:U60,0),0)","v":1630},{"$f":"OFFSET(Peaks!$C$41,MATCH(F169,Peaks!V42:V60,0),0)","v":1645},{"$f":"OFFSET(Peaks!$C$41,MATCH(G169,Peaks!W42:W60,0),0)","v":1615},{"$f":"OFFSET(Peaks!$C$41,MATCH(H169,Peaks!X42:X60,0),0)","v":1445},{"$f":"OFFSET(Peaks!$C$41,MATCH(I169,Peaks!Y42:Y60,0),0)","v":1445},{"$f":"OFFSET(Peaks!$C$41,MATCH(J169,Peaks!Z42:Z60,0),0)","v":1645},{"$f":"OFFSET(Peaks!$C$41,MATCH(K169,Peaks!AA42:AA60,0),0)","v":1645},{"$f":"OFFSET(Peaks2!$C$41,MATCH(L169,Peaks2!U42:U60,0),0)","v":{"$error":"#N/A"}},{"$f":"OFFSET(Peaks2!$C$41,MATCH(M169,Peaks2!V42:V60,0),0)","v":{"$error":"#N/A"}},{"$f":"OFFSET(Peaks2!$C$41,MATCH(N169,Peaks2!W42:W60,0),0)","v":{"$error":"#N/A"}},{"$f":"OFFSET(Peaks2!$C$41,MATCH(O169,Peaks2!X42:X60,0),0)","v":{"$error":"#N/A"}},{"$f":"OFFSET(Peaks2!$C$41,MATCH(P169,Peaks2!Y42:Y60,0),0)","v":{"$error":"#N/A"}},{"$f":"OFFSET(Peaks2!$C$41,MATCH(Q169,Peaks2!Z42:Z60,0),0)","v":{"$error":"#N/A"}},{"$f":"OFFSET(Peaks2!$C$41,MATCH(R169,Peaks2!AA42:AA60,0),0)","v":{"$error":"#N/A"}}]
[null,"   Volume",null,null,{"$f":"MAX(Peaks!U41:U61)","v":1022},{"$f":"MAX(Peaks!V41:V61)","v":1244},{"$f":"MAX(Peaks!W41:W61)","v":1089},{"$f":"MAX(Peaks!X41:X61)","v":659},{"$f":"MAX(Peaks!Y41:Y61)","v":614},{"$f":"MAX(Peaks!Z41:Z61)","v":1128},{"$f":"MAX(Peaks!AA41:AA61)","v":1049},{"$f":"MAX(Peaks2!U41:U61)","v":0},{"$f":"MAX(Peaks2!V41:V61)","v":0},{"$f":"MAX(Peaks2!W41:W61)","v":0},{"$f":"MAX(Peaks2!X41:X61)","v":0},{"$f":"MAX(Peaks2!Y41:Y61)","v":0},{"$f":"MAX(Peaks2!Z41:Z61)","v":0},{"$f":"MAX(Peaks2!AA41:AA61)","v":0}]

{"sheet":"RAMM Traffic and Loading Table","index":1,"n_rows":43,"n_cols":3,"rows_kept":43,"cut":false,"hidden":false,"merged":[]}
["Data to upload to RAMM"]
["Road ID",{"$f":"IFERROR(VLOOKUP(CountID,Programme,2,0),\"\")","v":10994},{"$f":"IFERROR(VLOOKUP(CountID2,Programme,2,0),\"\")","v":""}]
["Carraigeway Start",{"$f":"IFERROR(VLOOKUP(CountID,Programme,4,0),\"\")","v":752},{"$f":"IFERROR(VLOOKUP(CountID2,Programme,4,0),\"\")","v":""}]
["Direction","B",{"$f":"IF(CountID2=\"\",\"\",\"B\")","v":""}]
["Northing",{"$f":"GPS('7 day speed and Vol Summary'!G6)","v":"5946454"},{"$f":"IF(CountID2=\"\",\"\",GPS('7 day speed and Vol Summary'!K6))","v":""}]
["Easting",{"$f":"GPS('7 day speed and Vol Summary'!E6)","v":"1753938"},{"$f":"IF(CountID2=\"\",\"\",GPS('7 day speed and Vol Summary'!I6))","v":""}]
["Latest","L",{"$f":"IF(CountID2=\"\",\"\",\"L\")","v":""}]
["Count Date",{"$f":"'7 day speed and Vol Summary'!Q8","v":"2024-10-30"},{"$f":"IF(CountID2=\"\",\"\",'7 day speed and Vol Summary'!B54)","v":""}]
["Count Status","C",{"$f":"IF(CountID2=\"\",\"\",\"C\")","v":""}]
["Peak Hour",{"$f":"IF(Type=\"2Lane\",OFFSET(Peaks,MATCH(B14,TwoLane,0),0),IF(CountID2=\"\",OFFSET(Peaks2,MATCH(B14,Multi,0),0),OFFSET(Peaks2,MATCH(B14,TwoLane,0),0)))","v":1645},{"$f":"IF(CountID2=\"\",\"\",OFFSET(Peaks2!$C$3,MATCH(C14,SecondCount,0),0))","v":""}]
["Count Duration","7D",{"$f":"IF(CountID2=\"\",\"\",\"7D\")","v":""}]
["Financial Year",{"$f":"IFERROR(TEXT(EDATE(B8,-6),\"yyyy\")&\"/\"&TEXT(EDATE(B8,6),\"yy\"),\"\")","v":"2024/25"},{"$f":"IF(CountID2=\"\",\"\",TEXT(EDATE(C8+184,-12),\"yyyy\")&\"/\"&TEXT(EDATE(C8+184,0),\"yy\"))","v":""}]
["7 day ADT",{"$f":"ROUND(IF(Type=\"2Lane\",'7 day speed and Vol Summary'!Q118,IF(CountID2=\"\",'7 day speed and Vol Summary'!Q144,'7 day speed and Vol Summary'!Q118)),0)","v":9147},{"$f":"IF(CountID2=\"\",\"\",ROUND('7 day speed and Vol Summary'!Q137,0))","v":""}]
["PeakTraffic",{"$f":"IF(Type=\"2Lane\",MAX(TwoLane),IF(CountID2=\"\",MAX(Multi),MAX(TwoLane)))","v":1244},{"$f":"IF(CountID2=\"\",\"\",(MAX(SecondCount)))","v":""}]
["PcCar (CL1 & CL2)",{"$f":"IFERROR(ROUND(IF(Type=\"2Lane\",SUM('7 day speed and Vol Summary'!T$48:U$48)/'7 day speed and Vol Summary'!$AH$48,IF(CountID2=\"\",SUM('7 day speed and Vol Summary'!T$100:U$100)/'7 day speed and Vol Summary'!$AH$100,SUM('7 day speed and Vol Summary'!T$48:U$48)/'7 day speed and Vol Summary'!$AH$48)),2)*100&\"%\",\"\")","v":"97%"},{"$f":"IF(CountID2=\"\",\"\",ROUND(SUM('7 day speed and Vol Summary'!T$87:U$87)/'7 day speed and Vol Summary'!$AH$87,2)*100&\"%\")","v":""}]
["PcLCV (CL3)",{"$f":"IFERROR(ROUND(IF(Type=\"2Lane\",'7 day speed and Vol Summary'!V$48/'7 day speed and Vol Summary'!$AH$48,IF(CountID2=\"\",'7 day speed and Vol Summary'!V$100/'7 day speed and Vol Summary'!$AH$100,'7 day speed and Vol Summary'!V$48/'7 day speed and Vol Summary'!$AH$48)),2)*100&\"%\",\"\")","v":"1%"},{"$f":"IF(CountID2=\"\",\"\",ROUND('7 day speed and Vol Summary'!V$87/'7 day speed and Vol Summary'!$AH$87,2)*100&\"%\")","v":""}]
["PcMCV (CL4)",{"$f":"IFERROR(ROUND(IF(Type=\"2Lane\",'7 day speed and Vol Summary'!W$48/'7 day speed and Vol Summary'!$AH$48,IF(CountID2=\"\",'7 day speed and Vol Summary'!W$100/'7 day speed and Vol Summary'!$AH$100,'7 day speed and Vol Summary'!W$48/'7 day speed and Vol Summary'!$AH$48)),2)*100&\"%\",\"\")","v":"1%"},{"$f":"IF(CountID2=\"\",\"\",ROUND('7 day speed and Vol Summary'!W$87/'7 day speed and Vol Summary'!$AH$87,2)*100&\"%\")","v":""}]
["PcHCVI (CL5 to CL7)",{"$f":"IFERROR(ROUND(IF(Type=\"2Lane\",SUM('7 day speed and Vol Summary'!X$48:Z$48)/'7 day speed and Vol Summary'!$AH$48,IF(CountID2=\"\",SUM('7 day speed and Vol Summary'!X$100:Z$100)/'7 day speed and Vol Summary'!$AH$100,SUM('7 day speed and Vol Summary'!X$48:Z$48)/'7 day speed and Vol Summary'!$AH$48)),2)*100&\"%\",\"\")","v":"1%"},{"$f":"IF(CountID2=\"\",\"\",ROUND(SUM('7 day speed and Vol Summary'!X$87:Z$87)/'7 day speed and Vol Summary'!$AH$87,2)*100&\"%\")","v":""}]
["PcHCVII (CL8 to CL13)",{"$f":"IFERROR(ROUND(IF(Type=\"2Lane\",SUM('7 day speed and Vol Summary'!AA$48:AF$48)/'7 day speed and Vol Summary'!$AH$48,IF(CountID2=\"\",SUM('7 day speed and Vol Summary'!AA$100:AF$100)/'7 day speed and Vol Summary'!$AH$100,SUM('7 day speed and Vol Summary'!AA$48:AF$48)/'7 day speed and Vol Summary'!$AH$48)),2)*100&\"%\",\"\")","v":"0%"},{"$f":"IF(CountID2=\"\",\"\",ROUND(SUM('7 day speed and Vol Summary'!AA$87:AF$87)/'7 day speed and Vol Summary'!$AH$87,2)*100&\"%\")","v":""}]
["PcHeavy (CL4 to CL13)",{"$f":"IFERROR(ROUND(IF(Type=\"2Lane\",SUM('7 day speed and Vol Summary'!W$48:AF$48)/'7 day speed and Vol Summary'!$AH$48,IF(CountID2=\"\",SUM('7 day speed and Vol Summary'!W$100:AF$100)/'7 day speed and Vol Summary'!$AH$100,SUM('7 day speed and Vol Summary'!W$48:AF$48)/'7 day speed and Vol Summary'!$AH$48)),2)*100&\"%\",\"\")","v":"2%"},{"$f":"IF(CountID2=\"\",\"\",ROUND(SUM('7 day speed and Vol Summary'!W$87:AF$87)/'7 day speed and Vol Summary'!$AH$87,2)*100&\"%\")","v":""}]
["EsaMCV"]
["EsaHCVI"]
["EsaHCVII"]
["EsaHeavy"]
["Notes",{"$f":"\"85th %ile Speed -\"&TEXT(ROUND(IF(Type=\"2Lane\",'7 day speed and Vol Summary'!S$48,IF(CountID2=\"\",'7 day speed and Vol Summary'!S$100,'7 day speed and Vol Summary'!S$48)),1),\"00.0\")&\" km/hr\"","v":"85th %ile Speed -50.0 km/hr"},{"$f":"IF(CountID2=\"\",\"\",\"85th %ile Speed -\"&TEXT(ROUND('7 day speed and Vol Summary'!S$87,1),\"00.0\")&\" km/hr\")","v":""}]
["Auckland Transport Website"]
["5Days ADT",{"$f":"'7 day speed and Vol Summary'!Q143","v":9963}]
["7Days ADT",{"$f":"'7 day speed and Vol Summary'!Q144","v":9146.8571428571413}]
["Sat",{"$f":"'7 day speed and Vol Summary'!Q145","v":7505}]
["Sun",{"$f":"'7 day speed and Vol Summary'!Q146","v":6708}]
["AM Peak",{"$f":"MAX(Peaks2!AN4:AN19)","v":0}]
["AM Peak Hour",{"$f":"OFFSET(Peaks2,MATCH(B31,Peaks2!AN4:AN19,0),0)","v":"0515"}]
["Mid Peak",{"$f":"MAX(Peaks2!AN21:AN40)","v":0}]
["Mid Peak Hour",{"$f":"OFFSET(Peaks2!C20,MATCH(B33,Peaks2!AN21:AN40,0),0)","v":"0915"}]
["PM Peak",{"$f":"MAX(Peaks2!AN42:AN60)","v":0}]
["PM Peak Hour",{"$f":"OFFSET(Peaks2!C41,MATCH(B35,Peaks2!AN42:AN60,0),0)","v":1415}]
["Description",{"$f":"IF(Input!B4=\"\",\"\",Input!B4)","v":"-36.615015, 174.721501 [50] 1753938, 5946454"}]
["Car",{"$f":"ROUND('7 day speed and Vol Summary'!W143/100*0.84,3)","v":0.81899999999999995}]
["LCV",{"$f":"ROUND('7 day speed and Vol Summary'!W143/100*0.16,3)","v":0.156}]
["MCV",{"$f":"ROUND('7 day speed and Vol Summary'!W144/100,3)","v":1.0999999999999999E-2}]
["HCV-I",{"$f":"ROUND('7 day speed and Vol Summary'!W145/100,3)","v":1.4E-2}]
["HCV-II",{"$f":"ROUND('7 day speed and Vol Summary'!W146/100,3)","v":0}]
["HCV Total",{"$f":"ROUND('7 day speed and Vol Summary'!W147/100,3)","v":2.5000000000000001E-2}]

{"sheet":"Input","index":2,"n_rows":543,"n_cols":39,"rows_kept":543,"cut":false,"hidden":true,"merged":[]}
["Auckland Transport"]
[" Site Name ","VIPOND RD (STANMORE BAY)  (10994)"]
[" Site Attribute ","E1753938 N5946454"]
[" Description ","-36.615015, 174.721501 [50] 1753938, 5946454"]
["Start","DUNCANSBY RD"]
["End","COOPER RD"]
[" Posted Limit ","50 "]
[" Mean   ","Average speed"]
[]
["Wednesday, October 30, 2024"]
[]
["Time","Cd","Total","Cls","Cls","Cls","Cls","Cls","Cls","Cls","Cls","Cls","Cls","Cls","Cls","Cls","Cls","Drop","Drop","Drop","Drop","Vbin","Vbin","Vbin","Vbin","Vbin","Vbin","Vbin","Vbin","Vbin","Vbin","Vbin","Vbin","Vbin","Vbin","Vbin","Vbin","Vpp","Mean"]
["[--","","","1","2","3","4","5","6","7","8","9","10","11","12","13","14","--00","--15","--30","--45","0","10","20","30","40","50","60","70","80","90","100","110","120","130","140","150","85",""]
["","","","","","","","","","","","","","","","","","","","","","10","20","30","40","50","60","70","80","90","100","110","120","130","140","150","160","",""]
["0000","S",4,0,4,0,0,0,0,0,0,0,0,0,0,0,0,0,0,3,1,0,1,1,2,0,0,0,0,0,0,0,0,0,0,0,0,0,26.2]
["0000","P",2,0,2,0,0,0,0,0,0,0,0,0,0,0,0,0,0,2,0,0,0,0,2,0,0,0,0,0,0,0,0,0,0,0,0,0,36.4]
["0100","S",2,0,2,0,0,0,0,0,0,0,0,0,0,0,0,0,2,0,0,0,0,0,1,1,0,0,0,0,0,0,0,0,0,0,0,0,43.6]
["0100","P",7,0,7,0,0,0,0,0,0,0,0,0,0,0,0,4,0,1,2,0,0,0,2,3,2,0,0,0,0,0,0,0,0,0,0,0,43.5]
["0200","S",1,0,1,0,0,0,0,0,0,0,0,0,0,0,0,0,0,1,0,0,0,0,0,1,0,0,0,0,0,0,0,0,0,0,0,0,49.4]
["0200","P",2,0,2,0,0,0,0,0,0,0,0,0,0,0,0,0,0,0,2,0,0,1,0,1,0,0,0,0,0,0,0,0,0,0,0,0,33.200000000000003]
["0300","S",11,0,11,0,0,0,0,0,0,0,0,0,0,0,0,1,4,4,2,0,1,0,3,7,0,0,0,0,0,0,0,0,0,0,0,47.3,39.299999999999997]
["0300","P",2,0,2,0,0,0,0,0,0,0,0,0,0,0,0,1,1,0,0,0,0,1,1,0,0,0,0,0,0,0,0,0,0,0,0,0,30.6]
["0400","S",23,0,23,0,0,0,0,0,0,0,0,0,0,0,0,0,4,9,10,0,0,2,3,13,5,0,0,0,0,0,0,0,0,0,0,51,44.3]
["0400","P",3,0,3,0,0,0,0,0,0,0,0,0,0,0,0,1,1,0,1,0,0,0,2,1,0,0,0,0,0,0,0,0,0,0,0,0,38.4]
["0500","S",198,1,194,2,1,0,0,0,0,0,0,0,0,0,0,28,39,59,72,0,0,10,26,149,13,0,0,0,0,0,0,0,0,0,0,48.3,43.5]
["0500","P",11,0,11,0,0,0,0,0,0,0,0,0,0,0,0,2,5,1,3,0,0,0,2,4,4,1,0,0,0,0,0,0,0,0,0,58.9,48.1]
["0600","S",454,3,444,1,5,1,0,0,0,0,0,0,0,0,0,80,90,139,145,0,1,27,60,348,18,0,0,0,0,0,0,0,0,0,0,47.9,42.9]
["0600","P",42,0,41,0,1,0,0,0,0,0,0,0,0,0,0,4,7,12,19,0,0,2,5,25,9,1,0,0,0,0,0,0,0,0,0,51.5,45.5]
["0700","S",547,0,530,2,9,6,0,0,0,0,0,0,0,0,0,151,134,116,146,0,0,28,101,404,14,0,0,0,0,0,0,0,0,0,0,46.8,42.2]
["0700","P",103,0,100,1,2,0,0,0,0,0,0,0,0,0,0,13,22,27,41,0,0,1,7,64,29,1,1,0,0,0,0,0,0,0,0,52.5,47.6]
["0800","S",656,2,641,5,5,2,0,1,0,0,0,0,0,0,0,149,150,195,162,0,0,21,112,515,8,0,0,0,0,0,0,0,0,0,0,46.3,42.3]
["0800","P",223,0,214,0,3,5,0,0,1,0,0,0,0,0,0,36,68,60,59,0,1,3,16,144,55,3,0,0,0,0,0,0,1,0,0,52.8,47.7]
["0900","S",395,0,389,2,3,1,0,0,0,0,0,0,0,0,0,113,122,88,72,0,0,10,54,309,22,0,0,0,0,0,0,0,0,0,0,48,43.3]
["0900","P",155,0,146,2,2,5,0,0,0,0,0,0,0,0,0,34,36,43,42,0,0,3,12,87,53,0,0,0,0,0,0,0,0,0,0,52.7,47.4]
["1000","S",323,3,312,2,5,1,0,0,0,0,0,0,0,0,0,81,87,85,70,0,2,16,41,251,13,0,0,0,0,0,0,0,0,0,0,47.7,42.7]
["1000","P",149,0,140,0,3,6,0,0,0,0,0,0,0,0,0,32,37,36,44,0,0,0,14,75,56,3,1,0,0,0,0,0,0,0,0,54.3,48.2]
["1100","S",282,1,272,4,4,1,0,0,0,0,0,0,0,0,0,69,78,65,70,0,1,13,38,219,11,0,0,0,0,0,0,0,0,0,0,47.2,42.6]
["1100","P",172,2,160,2,2,4,0,2,0,0,0,0,0,0,0,43,34,50,45,0,2,3,19,94,51,3,0,0,0,0,0,0,0,0,0,52.6,46.4]
["1200","S",270,2,258,4,4,0,0,2,0,0,0,0,0,0,0,62,81,69,58,0,0,5,32,221,11,1,0,0,0,0,0,0,0,0,0,47.3,43.5]
["1200","P",204,1,187,0,5,11,0,0,0,0,0,0,0,0,0,58,49,47,50,0,0,6,19,112,66,1,0,0,0,0,0,0,0,0,0,52.7,47.1]
["1300","S",206,1,202,0,3,0,0,0,0,0,0,0,0,0,0,53,43,56,54,0,0,8,28,163,6,1,0,0,0,0,0,0,0,0,0,47.9,43.1]
["1300","P",193,1,179,2,2,8,0,1,0,0,0,0,0,0,0,40,43,59,51,0,0,1,27,119,40,6,0,0,0,0,0,0,0,0,0,52.7,46.7]
["1400","S",330,0,322,1,4,0,1,1,0,0,0,0,0,0,1,57,62,100,111,0,0,18,48,248,16,0,0,0,0,0,0,0,0,0,0,47,42.4]
["1400","P",322,1,301,1,4,15,0,0,0,0,0,0,0,0,0,65,64,103,90,0,0,1,25,197,90,9,0,0,0,0,0,0,0,0,0,53.3,47.7]
["1500","S",430,0,417,1,11,0,0,1,0,0,0,0,0,0,0,104,107,132,87,0,1,16,87,310,16,0,0,0,0,0,0,0,0,0,0,47.2,42.5]
["1500","P",488,0,470,1,4,12,1,0,0,0,0,0,0,0,0,109,133,122,124,0,0,7,63,301,115,2,0,0,0,0,0,0,0,0,0,51.3,46.3]
["1600","S",356,2,344,1,2,1,3,2,1,0,0,0,0,0,0,90,81,98,87,0,0,10,42,279,25,0,0,0,0,0,0,0,0,0,0,48.5,43.9]
["1600","P",586,1,562,2,1,20,0,0,0,0,0,0,0,0,0,118,146,147,175,0,0,3,52,364,164,2,1,0,0,0,0,0,0,0,0,52.6,47.3]
["1700","S",336,1,328,4,1,2,0,0,0,0,0,0,0,0,0,101,85,75,75,0,0,8,32,253,43,0,0,0,0,0,0,0,0,0,0,49.7,44.9]
["1700","P",636,3,608,0,5,16,2,1,0,0,0,0,0,0,1,144,185,149,158,0,3,5,60,356,205,7,0,0,0,0,0,0,0,0,0,52.8,47.4]
["1800","S",298,1,293,1,1,1,0,1,0,0,0,0,0,0,0,82,83,74,59,0,0,7,27,236,28,0,0,0,0,0,0,0,0,0,0,48.8,44.9]
["1800","P",479,4,459,1,1,9,1,3,1,0,0,0,0,0,0,164,133,103,79,0,0,5,59,255,149,11,0,0,0,0,0,0,0,0,0,53.3,47.1]
["1900","S",190,4,183,0,2,1,0,0,0,0,0,0,0,0,0,39,54,50,47,0,1,7,23,151,7,1,0,0,0,0,0,0,0,0,0,47.8,43.4]
["1900","P",231,4,210,2,1,11,0,1,1,1,0,0,0,0,0,87,55,47,42,0,0,1,22,132,69,5,2,0,0,0,0,0,0,0,0,52.7,48.2]
["2000","S",160,3,153,1,2,0,0,1,0,0,0,0,0,0,0,39,42,25,54,0,0,6,34,114,5,1,0,0,0,0,0,0,0,0,0,46.4,42.3]
["2000","P",131,2,119,1,1,7,0,0,1,0,0,0,0,0,0,37,40,22,32,0,0,2,40,70,18,0,0,0,0,0,1,0,0,0,0,49.9,43.9]
["2100","S",65,1,62,0,2,0,0,0,0,0,0,0,0,0,0,27,14,16,8,0,0,3,7,49,6,0,0,0,0,0,0,0,0,0,0,48.3,43.4]
["2100","P",79,1,73,0,1,4,0,0,0,0,0,0,0,0,0,29,16,14,20,0,0,1,16,42,14,4,2,0,0,0,0,0,0,0,0,52.7,46.3]
["2200","S",41,1,39,0,1,0,0,0,0,0,0,0,0,0,0,15,10,8,8,0,0,3,6,30,2,0,0,0,0,0,0,0,0,0,0,47.5,42.5]
["2200","P",54,1,46,0,1,6,0,0,0,0,0,0,0,0,0,25,8,13,8,0,0,2,1,39,11,1,0,0,0,0,0,0,0,0,0,52.1,46.9]
["2300","S",21,0,21,0,0,0,0,0,0,0,0,0,0,0,0,6,5,5,5,0,0,1,0,17,3,0,0,0,0,0,0,0,0,0,0,50.7,46.3]
["2300","P",38,0,34,0,0,4,0,0,0,0,0,0,0,0,0,9,11,11,7,0,0,0,11,23,3,1,0,0,0,0,0,0,0,0,0,49.5,43.8]
["07-19","S",4429,13,4308,27,52,15,4,8,1,0,0,0,0,0,1,1112,1113,1153,1051,0,4,160,642,3408,213,2,0,0,0,0,0,0,0,0,0,47.5,43.1]
["07-19","P",3710,13,3526,12,34,111,4,7,2,0,0,0,0,0,1,856,950,946,958,0,6,38,373,2168,1073,48,3,0,0,0,0,0,1,0,0,52.6,47.2]
["06-22","S",5298,24,5150,29,63,17,4,9,1,0,0,0,0,0,1,1297,1313,1383,1305,0,6,203,766,4070,249,4,0,0,0,0,0,0,0,0,0,47.5,43]
["06-22","P",4193,20,3969,15,38,133,4,8,4,1,0,0,0,0,1,1013,1068,1041,1071,0,6,44,456,2437,1183,58,7,0,0,0,1,0,1,0,0,52.6,47.1]
["06-00","S",5360,25,5210,29,64,17,4,9,1,0,0,0,0,0,1,1318,1328,1396,1318,0,6,207,772,4117,254,4,0,0,0,0,0,0,0,0,0,47.5,43.1]
["06-00","P",4285,21,4049,15,39,143,4,8,4,1,0,0,0,0,1,1047,1087,1065,1086,0,6,46,468,2499,1197,60,7,0,0,0,1,0,1,0,0,52.6,47.1]
["00-00","S",5599,26,5445,31,65,17,4,9,1,0,0,0,0,0,1,1347,1377,1472,1403,0,8,220,807,4288,272,4,0,0,0,0,0,0,0,0,0,47.7,43.1]
["00-00","P",4312,21,4076,15,39,143,4,8,4,1,0,0,0,0,1,1055,1094,1069,1094,0,6,48,477,2508,1203,61,7,0,0,0,1,0,1,0,0,52.6,47]
[]
[]
["Thursday, October 31, 2024"]
[]
["Time","Cd","Total","Cls","Cls","Cls","Cls","Cls","Cls","Cls","Cls","Cls","Cls","Cls","Cls","Cls","Cls","Drop","Drop","Drop","Drop","Vbin","Vbin","Vbin","Vbin","Vbin","Vbin","Vbin","Vbin","Vbin","Vbin","Vbin","Vbin","Vbin","Vbin","Vbin","Vbin","Vpp","Mean"]
["[--","","","1","2","3","4","5","6","7","8","9","10","11","12","13","14","--00","--15","--30","--45","0","10","20","30","40","50","60","70","80","90","100","110","120","130","140","150","85",""]
["","","","","","","","","","","","","","","","","","","","","","10","20","30","40","50","60","70","80","90","100","110","120","130","140","150","160","",""]
["0000","S",14,0,14,0,0,0,0,0,0,0,0,0,0,0,0,6,3,3,2,0,1,0,2,10,1,0,0,0,0,0,0,0,0,0,0,49.5,42.6]
["0000","P",21,0,19,0,0,2,0,0,0,0,0,0,0,0,0,8,6,3,4,0,0,0,2,8,10,1,0,0,0,0,0,0,0,0,0,57.6,50.3]
["0100","S",7,0,7,0,0,0,0,0,0,0,0,0,0,0,0,2,3,0,2,0,0,1,1,5,0,0,0,0,0,0,0,0,0,0,0,0,41.8]
["0100","P",16,1,12,0,0,3,0,0,0,0,0,0,0,0,0,6,4,3,3,0,0,0,3,6,6,0,0,0,1,0,0,0,0,0,0,58.3,50]
["0200","S",1,0,1,0,0,0,0,0,0,0,0,0,0,0,0,0,0,1,0,0,0,0,0,1,0,0,0,0,0,0,0,0,0,0,0,0,44.6]
["0200","P",4,0,4,0,0,0,0,0,0,0,0,0,0,0,0,3,0,1,0,0,0,0,0,3,0,1,0,0,0,0,0,0,0,0,0,0,49]
["0300","S",7,0,7,0,0,0,0,0,0,0,0,0,0,0,0,1,2,3,1,0,0,2,3,1,1,0,0,0,0,0,0,0,0,0,0,0,36.4]
["0300","P",6,0,6,0,0,0,0,0,0,0,0,0,0,0,0,2,0,2,2,0,0,1,3,2,0,0,0,0,0,0,0,0,0,0,0,0,36.700000000000003]
["0400","S",32,1,31,0,0,0,0,0,0,0,0,0,0,0,0,0,4,13,15,0,0,4,5,21,2,0,0,0,0,0,0,0,0,0,0,47.4,41.3]
["0400","P",6,0,3,0,1,2,0,0,0,0,0,0,0,0,0,4,0,2,0,0,0,1,4,0,1,0,0,0,0,0,0,0,0,0,0,0,37.9]
["0500","S",171,1,166,2,2,0,0,0,0,0,0,0,0,0,0,22,26,56,67,0,0,9,19,122,21,0,0,0,0,0,0,0,0,0,0,49.7,44]
["0500","P",8,0,8,0,0,0,0,0,0,0,0,0,0,0,0,0,2,1,5,0,0,0,1,5,2,0,0,0,0,0,0,0,0,0,0,0,46.7]
["0600","S",491,3,476,3,7,2,0,0,0,0,0,0,0,0,0,82,97,148,164,0,0,21,59,372,39,0,0,0,0,0,0,0,0,0,0,48.6,43.5]
["0600","P",41,1,34,2,0,3,0,1,0,0,0,0,0,0,0,9,7,8,17,0,0,0,5,17,15,4,0,0,0,0,0,0,0,0,0,57.4,49.2]
["0700","S",540,5,521,6,4,4,0,0,0,0,0,0,0,0,0,137,146,121,136,0,0,23,67,412,37,1,0,0,0,0,0,0,0,0,0,47.9,43.6]
["0700","P",99,0,91,1,3,4,0,0,0,0,0,0,0,0,0,20,17,31,31,0,0,1,5,62,30,1,0,0,0,0,0,0,0,0,0,52,48]
["0800","S",716,3,698,3,7,2,1,1,1,0,0,0,0,0,0,129,181,206,200,0,2,30,104,560,20,0,0,0,0,0,0,0,0,0,0,47,42.7]
["0800","P",236,0,222,1,2,11,0,0,0,0,0,0,0,0,0,42,76,57,61,0,1,4,17,143,69,2,0,0,0,0,0,0,0,0,0,52.2,47.1]
["0900","S",420,1,403,9,5,0,1,1,0,0,0,0,0,0,0,121,131,95,73,0,1,9,78,317,15,0,0,0,0,0,0,0,0,0,0,47.3,42.8]
["0900","P",159,0,149,1,1,6,0,2,0,0,0,0,0,0,0,42,43,37,37,0,0,1,19,101,35,3,0,0,0,0,0,0,0,0,0,52,46.2]
["1000","S",317,3,307,3,3,1,0,0,0,0,0,0,0,0,0,98,76,68,75,0,0,12,43,241,21,0,0,0,0,0,0,0,0,0,0,48.2,43.4]
["1000","P",183,1,170,3,2,7,0,0,0,0,0,0,0,0,0,47,45,47,44,0,1,4,23,108,42,4,0,1,0,0,0,0,0,0,0,53.1,46.2]
["1100","S",284,4,271,6,2,1,0,0,0,0,0,0,0,0,0,78,79,64,63,0,0,11,37,215,21,0,0,0,0,0,0,0,0,0,0,47.9,43.3]
["1100","P",156,2,148,3,2,0,1,0,0,0,0,0,0,0,0,46,42,33,35,0,0,2,17,91,41,5,0,0,0,0,0,0,0,0,0,53.1,47.2]
["1200","S",213,0,205,3,4,1,0,0,0,0,0,0,0,0,0,60,52,55,46,0,0,10,26,162,13,2,0,0,0,0,0,0,0,0,0,48.6,43.7]
["1200","P",214,1,194,9,6,4,0,0,0,0,0,0,0,0,0,40,57,57,60,0,0,3,34,97,75,4,1,0,0,0,0,0,0,0,0,53.4,47]
["1300","S",239,0,228,2,6,3,0,0,0,0,0,0,0,0,0,59,62,69,49,0,0,7,40,178,14,0,0,0,0,0,0,0,0,0,0,47.5,43.2]
["1300","P",237,3,223,4,2,5,0,0,0,0,0,0,0,0,0,50,57,63,67,0,0,3,13,138,80,3,0,0,0,0,0,0,0,0,0,53.5,47.7]
["1400","S",276,0,269,2,4,1,0,0,0,0,0,0,0,0,0,50,60,75,91,0,1,8,45,201,21,0,0,0,0,0,0,0,0,0,0,48.2,43.5]
["1400","P",299,3,287,5,3,1,0,0,0,0,0,0,0,0,0,66,76,89,68,0,0,3,24,151,118,2,1,0,0,0,0,0,0,0,0,53.6,48.2]
["1500","S",375,4,362,1,6,1,0,1,0,0,0,0,0,0,0,78,104,104,89,0,5,13,45,295,17,0,0,0,0,0,0,0,0,0,0,47.7,43.1]
["1500","P",508,3,495,4,0,5,0,0,1,0,0,0,0,0,0,128,114,115,151,0,0,7,36,292,159,10,1,2,0,1,0,0,0,0,0,53.1,47.9]
["1600","S",370,2,363,0,4,0,0,1,0,0,0,0,0,0,0,90,110,83,87,0,0,10,79,258,23,0,0,0,0,0,0,0,0,0,0,47.9,43.1]
["1600","P",758,4,724,4,5,16,1,2,0,1,0,0,0,0,1,168,181,200,209,0,1,12,68,470,200,7,0,0,0,0,0,0,0,0,0,51.7,46.9]
["1700","S",372,1,364,2,2,0,2,1,0,0,0,0,0,0,0,81,101,97,93,0,0,7,39,307,19,0,0,0,0,0,0,0,0,0,0,47.9,43.8]
["1700","P",863,7,834,4,8,6,1,0,1,0,0,0,0,0,2,226,229,214,194,0,0,8,72,576,204,3,0,0,0,0,0,0,0,0,0,51.8,46.8]
["1800","S",312,2,304,2,3,0,1,0,0,0,0,0,0,0,0,80,73,89,70,0,1,9,37,242,23,0,0,0,0,0,0,0,0,0,0,48.6,43.9]
["1800","P",382,3,362,3,1,12,0,0,0,0,1,0,0,0,0,104,111,93,74,0,0,2,40,183,148,8,1,0,0,0,0,0,0,0,0,53.8,48.4]
["1900","S",220,2,212,2,2,1,0,1,0,0,0,0,0,0,0,85,40,52,43,0,0,5,49,159,7,0,0,0,0,0,0,0,0,0,0,47.2,42.7]
["1900","P",206,3,195,0,5,3,0,0,0,0,0,0,0,0,0,57,57,56,36,0,0,2,22,105,73,1,1,1,1,0,0,0,0,0,0,53.3,47.9]
["2000","S",112,2,107,0,2,1,0,0,0,0,0,0,0,0,0,34,34,24,20,0,1,9,44,53,5,0,0,0,0,0,0,0,0,0,0,45.4,39.6]
["2000","P",147,1,142,0,0,4,0,0,0,0,0,0,0,0,0,43,30,37,37,0,0,3,25,84,33,2,0,0,0,0,0,0,0,0,0,52.7,46.2]
["2100","S",80,0,77,0,2,0,1,0,0,0,0,0,0,0,0,23,25,18,14,0,1,5,18,55,1,0,0,0,0,0,0,0,0,0,0,44.8,40.200000000000003]
["2100","P",116,4,110,0,1,1,0,0,0,0,0,0,0,0,0,30,29,32,25,0,1,4,18,75,16,2,0,0,0,0,0,0,0,0,0,50.2,44.7]
["2200","S",26,0,25,0,1,0,0,0,0,0,0,0,0,0,0,14,6,3,3,0,0,1,3,18,3,1,0,0,0,0,0,0,0,0,0,50.7,44]
["2200","P",60,0,53,0,1,6,0,0,0,0,0,0,0,0,0,20,20,15,5,0,0,2,4,37,17,0,0,0,0,0,0,0,0,0,0,53.2,46.3]
["2300","S",9,0,9,0,0,0,0,0,0,0,0,0,0,0,0,2,4,2,1,0,0,0,0,8,1,0,0,0,0,0,0,0,0,0,0,0,47.4]
["2300","P",28,1,26,0,1,0,0,0,0,0,0,0,0,0,0,9,5,5,9,0,0,1,8,12,6,0,1,0,0,0,0,0,0,0,0,55.6,45.2]
["07-19","S",4434,25,4295,39,50,14,5,5,1,0,0,0,0,0,0,1061,1175,1126,1072,0,10,149,640,3388,244,3,0,0,0,0,0,0,0,0,0,47.9,43.3]
["07-19","P",4094,27,3899,42,35,77,3,4,2,1,1,0,0,0,3,979,1048,1036,1031,0,3,50,368,2412,1201,52,4,3,0,1,0,0,0,0,0,52.6,47.3]
["06-22","S",5337,32,5167,44,63,18,6,6,1,0,0,0,0,0,0,1285,1371,1368,1313,0,12,189,810,4027,296,3,0,0,0,0,0,0,0,0,0,47.9,43.1]
["06-22","P",4604,36,4380,44,41,88,3,5,2,1,1,0,0,0,3,1118,1171,1169,1146,0,4,59,438,2693,1338,61,5,4,1,1,0,0,0,0,0,52.7,47.2]
["06-00","S",5372,32,5201,44,64,18,6,6,1,0,0,0,0,0,0,1301,1381,1373,1317,0,12,190,813,4053,300,4,0,0,0,0,0,0,0,0,0,47.9,43.2]
["06-00","P",4692,37,4459,44,43,94,3,5,2,1,1,0,0,0,3,1147,1196,1189,1160,0,4,62,450,2742,1361,61,6,4,1,1,0,0,0,0,0,52.7,47.2]
["00-00","S",5604,34,5427,46,66,18,6,6,1,0,0,0,0,0,0,1332,1419,1449,1404,0,13,206,843,4213,325,4,0,0,0,0,0,0,0,0,0,47.9,43.2]
["00-00","P",4753,38,4511,44,44,101,3,5,2,1,1,0,0,0,3,1170,1208,1201,1174,0,4,64,463,2766,1380,63,6,4,2,1,0,0,0,0,0,52.7,47.2]
[]
[]
["Friday, November 1, 2024"]
[]
["Time","Cd","Total","Cls","Cls","Cls","Cls","Cls","Cls","Cls","Cls","Cls","Cls","Cls","Cls","Cls","Cls","Drop","Drop","Drop","Drop","Vbin","Vbin","Vbin","Vbin","Vbin","Vbin","Vbin","Vbin","Vbin","Vbin","Vbin","Vbin","Vbin","Vbin","Vbin","Vbin","Vpp","Mean"]
["[--","","","1","2","3","4","5","6","7","8","9","10","11","12","13","14","--00","--15","--30","--45","0","10","20","30","40","50","60","70","80","90","100","110","120","130","140","150","85",""]
["","","","","","","","","","","","","","","","","","","","","","10","20","30","40","50","60","70","80","90","100","110","120","130","140","150","160","",""]
["0000","S",8,1,7,0,0,0,0,0,0,0,0,0,0,0,0,3,2,3,0,0,1,0,0,6,1,0,0,0,0,0,0,0,0,0,0,0,42.1]
["0000","P",11,0,11,0,0,0,0,0,0,0,0,0,0,0,0,4,3,3,1,0,0,0,1,4,6,0,0,0,0,0,0,0,0,0,0,54.6,49.5]
["0100","S",3,0,3,0,0,0,0,0,0,0,0,0,0,0,0,3,0,0,0,0,0,0,3,0,0,0,0,0,0,0,0,0,0,0,0,0,33.700000000000003]
["0100","P",8,0,7,0,0,1,0,0,0,0,0,0,0,0,0,6,0,1,1,0,0,0,3,5,0,0,0,0,0,0,0,0,0,0,0,0,41.3]
["0200","S",0,0,0,0,0,0,0,0,0,0,0,0,0,0,0,0,0,0,0,0,0,0,0,0,0,0,0,0,0,0,0,0,0,0,0,0,"-"]
["0200","P",4,0,3,0,0,1,0,0,0,0,0,0,0,0,0,1,2,0,1,0,0,0,0,3,1,0,0,0,0,0,0,0,0,0,0,0,47.7]
["0300","S",10,0,10,0,0,0,0,0,0,0,0,0,0,0,0,1,1,6,2,0,0,1,4,4,1,0,0,0,0,0,0,0,0,0,0,0,39.700000000000003]
["0300","P",7,0,6,0,0,1,0,0,0,0,0,0,0,0,0,3,2,1,1,0,0,1,0,5,1,0,0,0,0,0,0,0,0,0,0,0,44.5]
["0400","S",26,0,26,0,0,0,0,0,0,0,0,0,0,0,0,4,4,8,10,0,0,1,7,15,3,0,0,0,0,0,0,0,0,0,0,49.7,43]
["0400","P",5,0,5,0,0,0,0,0,0,0,0,0,0,0,0,1,0,1,3,0,0,0,4,1,0,0,0,0,0,0,0,0,0,0,0,0,39]
["0500","S",173,2,168,2,0,1,0,0,0,0,0,0,0,0,0,17,30,56,70,0,0,9,30,116,18,0,0,0,0,0,0,0,0,0,0,48.6,43.2]
["0500","P",22,0,17,1,0,4,0,0,0,0,0,0,0,0,0,3,7,3,9,0,0,1,1,14,4,2,0,0,0,0,0,0,0,0,0,54.6,47.7]
["0600","S",424,6,404,6,4,4,0,0,0,0,0,0,0,0,0,75,70,128,151,0,0,26,59,304,35,0,0,0,0,0,0,0,0,0,0,48.4,43]
["0600","P",54,1,50,0,0,3,0,0,0,0,0,0,0,0,0,12,11,8,23,0,0,0,5,21,24,4,0,0,0,0,0,0,0,0,0,56.7,49.5]
["0700","S",517,5,493,5,9,4,0,0,0,0,0,0,0,1,0,143,119,124,131,0,0,15,64,411,27,0,0,0,0,0,0,0,0,0,0,48.2,43.8]
["0700","P",108,2,92,2,2,8,1,1,0,0,0,0,0,0,0,20,28,28,32,0,1,2,7,51,46,1,0,0,0,0,0,0,0,0,0,53.3,47.7]
["0800","S",709,7,687,5,6,3,1,0,0,0,0,0,0,0,0,142,172,227,168,0,0,21,103,563,22,0,0,0,0,0,0,0,0,0,0,47,43]
["0800","P",225,0,203,1,3,17,0,0,0,1,0,0,0,0,0,49,57,67,52,0,0,1,26,144,52,2,0,0,0,0,0,0,0,0,0,52.2,46.4]
["0900","S",397,4,380,5,7,0,0,1,0,0,0,0,0,0,0,111,93,96,97,0,0,9,38,331,19,0,0,0,0,0,0,0,0,0,0,48.1,44.2]
["0900","P",182,3,170,0,2,5,1,1,0,0,0,0,0,0,0,35,51,42,54,0,2,2,23,90,60,5,0,0,0,0,0,0,0,0,0,54,46.9]
["1000","S",371,5,353,4,5,1,1,1,0,0,0,0,0,0,1,112,87,89,83,0,0,12,65,278,16,0,0,0,0,0,0,0,0,0,0,47.4,42.8]
["1000","P",155,0,151,0,4,0,0,0,0,0,0,0,0,0,0,39,44,29,43,0,0,2,17,87,47,2,0,0,0,0,0,0,0,0,0,53,47]
["1100","S",306,1,299,3,1,1,0,0,1,0,0,0,0,0,0,89,75,69,73,0,2,10,40,243,11,0,0,0,0,0,0,0,0,0,0,46.8,42.8]
["1100","P",203,4,189,3,4,3,0,0,0,0,0,0,0,0,0,52,44,40,67,0,0,1,21,111,70,0,0,0,0,0,0,0,0,0,0,52.9,47.5]
["1200","S",251,2,234,6,7,0,1,1,0,0,0,0,0,0,0,59,60,73,59,0,1,11,39,190,10,0,0,0,0,0,0,0,0,0,0,47.3,42.5]
["1200","P",245,1,230,3,5,4,1,0,1,0,0,0,0,0,0,64,65,56,60,0,1,2,23,135,79,5,0,0,0,0,0,0,0,0,0,53.5,47.5]
["1300","S",244,1,236,3,3,1,0,0,0,0,0,0,0,0,0,55,54,69,66,0,0,11,35,174,24,0,0,0,0,0,0,0,0,0,0,48.8,43.5]
["1300","P",219,4,204,1,7,2,1,0,0,0,0,0,0,0,0,52,40,63,64,0,0,1,17,112,83,5,1,0,0,0,0,0,0,0,0,54.7,48.8]
["1400","S",291,2,275,6,5,1,1,1,0,0,0,0,0,0,0,65,66,71,89,0,0,12,35,236,8,0,0,0,0,0,0,0,0,0,0,47.7,43]
["1400","P",407,2,394,2,1,6,0,0,0,0,0,0,0,0,2,86,102,110,109,0,1,7,41,217,135,5,0,1,0,0,0,0,0,0,0,53.1,47.3]
["1500","S",403,3,383,4,10,3,0,0,0,0,0,0,0,0,0,90,100,102,111,0,0,19,64,304,16,0,0,0,0,0,0,0,0,0,0,47.3,42.8]
["1500","P",524,3,504,2,4,11,0,0,0,0,0,0,0,0,0,105,135,147,137,0,1,13,52,301,155,2,0,0,0,0,0,0,0,0,0,51.8,46.6]
["1600","S",373,0,366,3,2,1,1,0,0,0,0,0,0,0,0,76,91,81,125,0,0,11,33,319,10,0,0,0,0,0,0,0,0,0,0,47.3,43.4]
["1600","P",692,7,664,5,10,5,0,1,0,0,0,0,0,0,0,151,166,189,186,0,2,10,57,419,200,3,1,0,0,0,0,0,0,0,0,52.2,47.2]
["1700","S",332,3,323,2,0,2,1,1,0,0,0,0,0,0,0,79,90,63,100,0,3,5,56,247,21,0,0,0,0,0,0,0,0,0,0,48.4,43.6]
["1700","P",573,9,551,3,4,4,1,0,1,0,0,0,0,0,0,172,130,130,141,0,2,3,59,346,151,11,1,0,0,0,0,0,0,0,0,52.7,47]
["1800","S",292,1,285,3,2,0,0,1,0,0,0,0,0,0,0,74,80,75,63,0,0,9,29,233,21,0,0,0,0,0,0,0,0,0,0,48.1,44.1]
["1800","P",355,7,342,1,3,2,0,0,0,0,0,0,0,0,0,102,100,83,70,0,1,3,32,187,120,11,1,0,0,0,0,0,0,0,0,54,48.2]
["1900","S",164,0,160,1,2,1,0,0,0,0,0,0,0,0,0,53,48,25,38,0,0,4,20,129,11,0,0,0,0,0,0,0,0,0,0,48.5,43.9]
["1900","P",195,1,191,0,0,3,0,0,0,0,0,0,0,0,0,64,52,33,46,0,0,1,11,98,78,6,1,0,0,0,0,0,0,0,0,54.6,49.2]
["2000","S",170,1,165,0,3,0,0,1,0,0,0,0,0,0,0,51,56,25,38,0,1,8,34,122,5,0,0,0,0,0,0,0,0,0,0,46.6,42]
["2000","P",136,1,129,0,1,5,0,0,0,0,0,0,0,0,0,39,32,33,32,0,1,5,19,81,28,2,0,0,0,0,0,0,0,0,0,51,44.8]
["2100","S",58,1,56,0,1,0,0,0,0,0,0,0,0,0,0,24,14,9,11,0,0,3,10,41,3,1,0,0,0,0,0,0,0,0,0,47.9,43.1]
["2100","P",97,0,90,1,1,5,0,0,0,0,0,0,0,0,0,33,27,15,22,0,0,2,13,48,32,1,1,0,0,0,0,0,0,0,0,53.3,47]
["2200","S",40,0,39,0,1,0,0,0,0,0,0,0,0,0,0,12,8,12,8,0,0,0,12,25,2,1,0,0,0,0,0,0,0,0,0,48.5,42.8]
["2200","P",70,1,66,0,1,2,0,0,0,0,0,0,0,0,0,18,18,18,16,0,0,1,10,37,19,3,0,0,0,0,0,0,0,0,0,53.8,46.8]
["2300","S",20,0,20,0,0,0,0,0,0,0,0,0,0,0,0,6,8,1,5,0,0,0,2,14,4,0,0,0,0,0,0,0,0,0,0,52.6,45.7]
["2300","P",35,0,34,0,0,1,0,0,0,0,0,0,0,0,0,11,8,5,11,0,0,0,1,14,19,1,0,0,0,0,0,0,0,0,0,56,50.5]
["07-19","S",4486,34,4314,49,57,17,6,6,1,0,0,0,0,1,1,1095,1087,1139,1165,0,6,145,601,3529,205,0,0,0,0,0,0,0,0,0,0,47.7,43.3]
["07-19","P",3888,42,3694,23,49,67,5,3,2,1,0,0,0,0,2,927,962,984,1015,0,11,47,375,2200,1198,52,4,1,0,0,0,0,0,0,0,52.9,47.2]
["06-22","S",5302,42,5099,56,67,22,6,7,1,0,0,0,0,1,1,1298,1275,1326,1403,0,7,186,724,4125,259,1,0,0,0,0,0,0,0,0,0,47.7,43.3]
["06-22","P",4370,45,4154,24,51,83,5,3,2,1,0,0,0,0,2,1075,1084,1073,1138,0,12,55,423,2448,1360,65,6,1,0,0,0,0,0,0,0,52.9,47.3]
["06-00","S",5362,42,5158,56,68,22,6,7,1,0,0,0,0,1,1,1316,1291,1339,1416,0,7,186,738,4164,265,2,0,0,0,0,0,0,0,0,0,47.7,43.3]
["06-00","P",4475,46,4254,24,52,86,5,3,2,1,0,0,0,0,2,1104,1110,1096,1165,0,12,56,434,2499,1398,69,6,1,0,0,0,0,0,0,0,52.9,47.3]
["00-00","S",5582,45,5372,58,68,23,6,7,1,0,0,0,0,1,1,1344,1328,1412,1498,0,8,197,782,4305,288,2,0,0,0,0,0,0,0,0,0,47.7,43.2]
["00-00","P",4532,46,4303,25,52,93,5,3,2,1,0,0,0,0,2,1122,1124,1105,1181,0,12,58,443,2531,1410,71,6,1,0,0,0,0,0,0,0,52.9,47.3]
[]
[]
["Saturday, November 2, 2024"]
[]
["Time","Cd","Total","Cls","Cls","Cls","Cls","Cls","Cls","Cls","Cls","Cls","Cls","Cls","Cls","Cls","Cls","Drop","Drop","Drop","Drop","Vbin","Vbin","Vbin","Vbin","Vbin","Vbin","Vbin","Vbin","Vbin","Vbin","Vbin","Vbin","Vbin","Vbin","Vbin","Vbin","Vpp","Mean"]
["[--","","","1","2","3","4","5","6","7","8","9","10","11","12","13","14","--00","--15","--30","--45","0","10","20","30","40","50","60","70","80","90","100","110","120","130","140","150","85",""]
["","","","","","","","","","","","","","","","","","","","","","10","20","30","40","50","60","70","80","90","100","110","120","130","140","150","160","",""]
["0000","S",18,0,18,0,0,0,0,0,0,0,0,0,0,0,0,7,2,7,2,0,0,1,5,10,2,0,0,0,0,0,0,0,0,0,0,49,42.5]
["0000","P",17,0,17,0,0,0,0,0,0,0,0,0,0,0,0,6,2,8,1,0,0,0,4,9,3,0,1,0,0,0,0,0,0,0,0,53.7,46.1]
["0100","S",2,0,2,0,0,0,0,0,0,0,0,0,0,0,0,1,0,0,1,0,0,0,0,2,0,0,0,0,0,0,0,0,0,0,0,0,42.1]
["0100","P",8,0,8,0,0,0,0,0,0,0,0,0,0,0,0,2,2,3,1,0,0,0,1,4,3,0,0,0,0,0,0,0,0,0,0,0,48.3]
["0200","S",2,0,2,0,0,0,0,0,0,0,0,0,0,0,0,1,0,1,0,0,0,0,0,2,0,0,0,0,0,0,0,0,0,0,0,0,44.8]
["0200","P",9,0,8,0,0,1,0,0,0,0,0,0,0,0,0,4,2,1,2,0,0,0,0,9,0,0,0,0,0,0,0,0,0,0,0,0,44.3]
["0300","S",9,0,9,0,0,0,0,0,0,0,0,0,0,0,0,3,2,3,1,0,0,0,3,5,1,0,0,0,0,0,0,0,0,0,0,0,44.5]
["0300","P",5,0,5,0,0,0,0,0,0,0,0,0,0,0,0,1,3,0,1,0,0,1,0,1,1,2,0,0,0,0,0,0,0,0,0,0,52.5]
["0400","S",18,1,17,0,0,0,0,0,0,0,0,0,0,0,0,3,6,8,1,0,0,1,6,9,2,0,0,0,0,0,0,0,0,0,0,48.8,40.4]
["0400","P",9,0,9,0,0,0,0,0,0,0,0,0,0,0,0,0,4,3,2,0,0,0,1,3,4,1,0,0,0,0,0,0,0,0,0,0,49.5]
["0500","S",36,1,33,1,0,1,0,0,0,0,0,0,0,0,0,1,9,12,14,0,0,2,8,22,4,0,0,0,0,0,0,0,0,0,0,47.7,42]
["0500","P",13,1,10,0,0,2,0,0,0,0,0,0,0,0,0,3,1,2,7,0,0,0,1,8,4,0,0,0,0,0,0,0,0,0,0,53.2,47.3]
["0600","S",97,3,92,1,0,1,0,0,0,0,0,0,0,0,0,23,25,21,28,0,0,9,6,72,10,0,0,0,0,0,0,0,0,0,0,49.7,44]
["0600","P",24,0,22,1,0,1,0,0,0,0,0,0,0,0,0,4,5,8,7,0,0,0,2,5,14,2,1,0,0,0,0,0,0,0,0,59.8,52.5]
["0700","S",181,3,171,3,3,1,0,0,0,0,0,0,0,0,0,17,37,50,77,0,0,11,27,129,14,0,0,0,0,0,0,0,0,0,0,48.6,43.1]
["0700","P",56,4,47,0,0,5,0,0,0,0,0,0,0,0,0,12,14,12,18,0,1,1,8,22,20,4,0,0,0,0,0,0,0,0,0,55.9,47.8]
["0800","S",321,5,311,2,3,0,0,0,0,0,0,0,0,0,0,60,75,77,109,0,0,20,32,243,26,0,0,0,0,0,0,0,0,0,0,48.6,43.7]
["0800","P",94,3,84,2,2,3,0,0,0,0,0,0,0,0,0,16,21,28,29,0,2,0,7,57,26,2,0,0,0,0,0,0,0,0,0,52.6,46.6]
["0900","S",401,2,385,7,5,1,0,1,0,0,0,0,0,0,0,94,97,95,115,0,0,14,64,312,11,0,0,0,0,0,0,0,0,0,0,47.3,42.7]
["0900","P",159,2,150,1,2,4,0,0,0,0,0,0,0,0,0,31,47,37,44,0,1,1,15,79,58,5,0,0,0,0,0,0,0,0,0,54.2,48]
["1000","S",419,3,403,6,5,1,0,0,0,0,0,0,0,0,1,108,114,92,105,0,1,23,68,316,10,1,0,0,0,0,0,0,0,0,0,47,42.4]
["1000","P",237,4,222,3,5,3,0,0,0,0,0,0,0,0,0,55,42,59,81,0,0,2,23,120,90,2,0,0,0,0,0,0,0,0,0,53.5,47.7]
["1100","S",377,1,368,2,3,1,0,1,0,0,0,0,0,0,1,98,113,76,90,0,0,15,48,302,12,0,0,0,0,0,0,0,0,0,0,47.3,43.1]
["1100","P",259,1,250,4,3,0,0,1,0,0,0,0,0,0,0,65,67,61,66,0,0,2,29,148,76,4,0,0,0,0,0,0,0,0,0,53.1,47.2]
["1200","S",360,0,350,8,2,0,0,0,0,0,0,0,0,0,0,87,108,89,76,0,0,10,51,283,16,0,0,0,0,0,0,0,0,0,0,48.2,43.4]
["1200","P",315,3,305,3,2,2,0,0,0,0,0,0,0,0,0,80,88,74,73,0,1,5,35,158,106,8,2,0,0,0,0,0,0,0,0,54,47.5]
["1300","S",324,4,304,12,3,0,0,1,0,0,0,0,0,0,0,83,73,84,84,0,0,13,41,245,25,0,0,0,0,0,0,0,0,0,0,48.6,43.7]
["1300","P",320,6,308,4,1,0,0,0,0,0,0,0,0,0,1,85,77,74,84,0,0,3,38,166,110,3,0,0,0,0,0,0,0,0,0,53.1,47.2]
["1400","S",317,4,306,3,2,0,1,1,0,0,0,0,0,0,0,82,75,64,96,0,4,13,50,233,17,0,0,0,0,0,0,0,0,0,0,47.9,42.5]
["1400","P",305,5,287,7,1,3,2,0,0,0,0,0,0,0,0,84,64,67,90,0,2,4,32,172,90,5,0,0,0,0,0,0,0,0,0,52.9,47]
["1500","S",286,4,275,2,3,0,0,1,0,0,0,0,0,0,1,61,79,80,66,0,0,8,45,216,16,0,1,0,0,0,0,0,0,0,0,47.7,43.2]
["1500","P",328,7,312,3,0,6,0,0,0,0,0,0,0,0,0,85,77,91,75,0,1,7,42,174,97,2,4,0,1,0,0,0,0,0,0,52.6,46.7]
["1600","S",320,2,309,4,2,0,2,1,0,0,0,0,0,0,0,84,78,71,87,0,0,17,47,249,7,0,0,0,0,0,0,0,0,0,0,47.3,42.4]
["1600","P",307,3,296,0,0,7,0,0,1,0,0,0,0,0,0,90,73,69,75,0,0,3,33,182,85,4,0,0,0,0,0,0,0,0,0,52.9,47]
["1700","S",222,2,216,1,3,0,0,0,0,0,0,0,0,0,0,58,56,51,57,0,0,12,32,161,16,1,0,0,0,0,0,0,0,0,0,48.1,43.3]
["1700","P",229,0,217,2,3,7,0,0,0,0,0,0,0,0,0,60,50,66,53,0,1,0,23,121,80,4,0,0,0,0,0,0,0,0,0,53.6,47.9]
["1800","S",200,1,192,2,2,1,1,1,0,0,0,0,0,0,0,65,57,44,34,0,1,9,20,151,19,0,0,0,0,0,0,0,0,0,0,48.4,43.6]
["1800","P",172,4,160,0,1,5,2,0,0,0,0,0,0,0,0,43,47,44,38,0,1,3,30,72,59,5,1,0,1,0,0,0,0,0,0,53.5,47.3]
["1900","S",100,0,98,0,2,0,0,0,0,0,0,0,0,0,0,29,23,21,27,0,0,7,21,65,7,0,0,0,0,0,0,0,0,0,0,47.7,42.1]
["1900","P",113,5,104,0,1,3,0,0,0,0,0,0,0,0,0,24,34,29,26,0,0,0,12,51,44,4,2,0,0,0,0,0,0,0,0,54.7,48.9]
["2000","S",89,0,87,0,2,0,0,0,0,0,0,0,0,0,0,32,19,19,19,0,0,6,18,64,0,1,0,0,0,0,0,0,0,0,0,46.9,41.8]
["2000","P",86,0,78,1,0,6,0,1,0,0,0,0,0,0,0,30,16,23,17,0,1,0,13,51,19,1,1,0,0,0,0,0,0,0,0,51.3,46.1]
["2100","S",59,0,54,1,3,0,0,1,0,0,0,0,0,0,0,22,15,12,10,0,0,3,12,40,4,0,0,0,0,0,0,0,0,0,0,47.7,42.8]
["2100","P",90,0,84,0,1,5,0,0,0,0,0,0,0,0,0,27,18,22,23,0,0,1,12,57,19,0,0,1,0,0,0,0,0,0,0,51.9,46]
["2200","S",30,1,28,0,1,0,0,0,0,0,0,0,0,0,0,12,6,5,7,0,1,3,6,20,0,0,0,0,0,0,0,0,0,0,0,44.9,39.700000000000003]
["2200","P",89,1,82,0,0,6,0,0,0,0,0,0,0,0,0,31,24,20,14,0,2,1,11,61,12,2,0,0,0,0,0,0,0,0,0,50.7,45]
["2300","S",27,0,26,0,1,0,0,0,0,0,0,0,0,0,0,6,6,9,6,0,0,3,5,19,0,0,0,0,0,0,0,0,0,0,0,47.3,41.2]
["2300","P",46,0,43,0,0,3,0,0,0,0,0,0,0,0,0,13,13,9,11,0,0,0,11,19,15,1,0,0,0,0,0,0,0,0,0,55.1,46.3]
["07-19","S",3728,31,3590,52,36,5,4,7,0,0,0,0,0,0,3,897,962,873,996,0,6,165,525,2840,189,2,1,0,0,0,0,0,0,0,0,47.9,43]
["07-19","P",2781,42,2638,29,20,45,4,1,1,0,0,0,0,0,1,706,667,682,726,0,10,31,315,1471,897,48,7,0,2,0,0,0,0,0,0,53.3,47.3]
["06-22","S",4073,34,3921,54,43,6,4,8,0,0,0,0,0,0,3,1003,1044,946,1080,0,6,190,582,3081,210,3,1,0,0,0,0,0,0,0,0,47.9,43]
["06-22","P",3094,47,2926,31,22,60,4,2,1,0,0,0,0,0,1,791,740,764,799,0,11,32,354,1635,993,55,11,1,2,0,0,0,0,0,0,53.5,47.3]
["06-00","S",4130,35,3975,54,45,6,4,8,0,0,0,0,0,0,3,1021,1056,960,1093,0,7,196,593,3120,210,3,1,0,0,0,0,0,0,0,0,47.9,43]
["06-00","P",3229,48,3051,31,22,69,4,2,1,0,0,0,0,0,1,835,777,793,824,0,13,33,376,1715,1020,58,11,1,2,0,0,0,0,0,0,53.5,47.2]
["00-00","S",4215,37,4056,55,45,7,4,8,0,0,0,0,0,0,3,1037,1075,991,1112,0,7,200,615,3170,219,3,1,0,0,0,0,0,0,0,0,47.9,43]
["00-00","P",3290,49,3108,31,22,72,4,2,1,0,0,0,0,0,1,851,791,810,838,0,13,34,383,1749,1035,61,12,1,2,0,0,0,0,0,0,53.5,47.2]
[]
[]
["Sunday, November 3, 2024"]
[]
["Time","Cd","Total","Cls","Cls","Cls","Cls","Cls","Cls","Cls","Cls","Cls","Cls","Cls","Cls","Cls","Cls","Drop","Drop","Drop","Drop","Vbin","Vbin","Vbin","Vbin","Vbin","Vbin","Vbin","Vbin","Vbin","Vbin","Vbin","Vbin","Vbin","Vbin","Vbin","Vbin","Vpp","Mean"]
["[--","","","1","2","3","4","5","6","7","8","9","10","11","12","13","14","--00","--15","--30","--45","0","10","20","30","40","50","60","70","80","90","100","110","120","130","140","150","85",""]
["","","","","","","","","","","","","","","","","","","","","","10","20","30","40","50","60","70","80","90","100","110","120","130","140","150","160","",""]
["0000","S",15,0,15,0,0,0,0,0,0,0,0,0,0,0,0,6,3,5,1,0,0,4,5,6,0,0,0,0,0,0,0,0,0,0,0,43.8,36.299999999999997]
["0000","P",34,0,30,0,0,4,0,0,0,0,0,0,0,0,0,12,10,5,7,0,0,1,4,13,16,0,0,0,0,0,0,0,0,0,0,52.4,47.2]
["0100","S",14,0,14,0,0,0,0,0,0,0,0,0,0,0,0,3,5,5,1,0,0,1,9,4,0,0,0,0,0,0,0,0,0,0,0,44.5,37.200000000000003]
["0100","P",16,0,13,0,0,3,0,0,0,0,0,0,0,0,0,6,2,3,5,0,0,0,4,10,2,0,0,0,0,0,0,0,0,0,0,49.5,44.6]
["0200","S",9,0,9,0,0,0,0,0,0,0,0,0,0,0,0,3,3,1,2,0,0,0,5,4,0,0,0,0,0,0,0,0,0,0,0,0,38.1]
["0200","P",11,0,11,0,0,0,0,0,0,0,0,0,0,0,0,3,4,2,2,0,0,0,4,4,3,0,0,0,0,0,0,0,0,0,0,52.6,44.2]
["0300","S",9,0,9,0,0,0,0,0,0,0,0,0,0,0,0,3,2,3,1,0,0,0,1,8,0,0,0,0,0,0,0,0,0,0,0,0,43.2]
["0300","P",14,0,13,0,1,0,0,0,0,0,0,0,0,0,0,3,3,4,4,0,0,0,3,8,3,0,0,0,0,0,0,0,0,0,0,51.8,45]
["0400","S",21,2,19,0,0,0,0,0,0,0,0,0,0,0,0,4,5,6,6,0,0,2,2,11,6,0,0,0,0,0,0,0,0,0,0,53.5,45.2]
["0400","P",6,0,6,0,0,0,0,0,0,0,0,0,0,0,0,0,0,3,3,0,0,0,1,3,1,0,1,0,0,0,0,0,0,0,0,0,50.8]
["0500","S",24,0,23,0,0,1,0,0,0,0,0,0,0,0,0,2,4,10,8,0,0,3,0,17,4,0,0,0,0,0,0,0,0,0,0,51.7,44.6]
["0500","P",7,0,7,0,0,0,0,0,0,0,0,0,0,0,0,2,2,1,2,0,0,0,1,4,2,0,0,0,0,0,0,0,0,0,0,0,47.3]
["0600","S",53,1,51,1,0,0,0,0,0,0,0,0,0,0,0,9,11,19,14,0,1,7,4,29,11,0,1,0,0,0,0,0,0,0,0,52.4,43.3]
["0600","P",17,0,16,0,0,1,0,0,0,0,0,0,0,0,0,0,4,8,5,0,0,0,2,6,8,0,1,0,0,0,0,0,0,0,0,56.2,49.6]
["0700","S",102,2,97,0,2,1,0,0,0,0,0,0,0,0,0,18,22,31,31,0,0,7,12,72,10,1,0,0,0,0,0,0,0,0,0,49.7,43.7]
["0700","P",40,1,37,0,0,2,0,0,0,0,0,0,0,0,0,2,13,7,18,0,0,0,2,17,19,2,0,0,0,0,0,0,0,0,0,56.2,49.9]
["0800","S",229,4,222,0,2,0,0,1,0,0,0,0,0,0,0,61,45,61,62,0,0,13,21,180,15,0,0,0,0,0,0,0,0,0,0,47.9,43.5]
["0800","P",68,1,61,1,0,5,0,0,0,0,0,0,0,0,0,13,21,17,17,0,0,0,5,43,18,2,0,0,0,0,0,0,0,0,0,52.6,47.4]
["0900","S",350,6,339,3,1,0,0,1,0,0,0,0,0,0,0,70,95,89,96,0,0,18,46,271,15,0,0,0,0,0,0,0,0,0,0,47.6,43.2]
["0900","P",151,2,139,2,0,7,0,1,0,0,0,0,0,0,0,32,38,42,39,0,0,0,13,77,58,2,1,0,0,0,0,0,0,0,0,53.4,48.5]
["1000","S",378,2,369,4,3,0,0,0,0,0,0,0,0,0,0,94,94,90,100,0,0,14,48,302,14,0,0,0,0,0,0,0,0,0,0,47.5,42.9]
["1000","P",215,2,206,2,1,4,0,0,0,0,0,0,0,0,0,46,53,56,60,0,0,3,19,127,64,2,0,0,0,0,0,0,0,0,0,53.2,47.1]
["1100","S",352,2,347,1,2,0,0,0,0,0,0,0,0,0,0,98,90,80,84,0,1,14,53,271,12,1,0,0,0,0,0,0,0,0,0,47.9,42.9]
["1100","P",252,2,241,4,0,3,2,0,0,0,0,0,0,0,0,53,59,64,76,0,1,3,33,141,71,3,0,0,0,0,0,0,0,0,0,52.4,46.6]
["1200","S",373,3,362,4,3,0,0,0,1,0,0,0,0,0,0,103,89,96,85,0,0,22,59,279,13,0,0,0,0,0,0,0,0,0,0,47,42.3]
["1200","P",295,2,282,4,4,2,1,0,0,0,0,0,0,0,0,81,71,68,75,0,0,5,37,173,74,3,2,0,0,0,0,0,0,1,0,52.6,46.7]
["1300","S",306,3,297,3,3,0,0,0,0,0,0,0,0,0,0,80,74,79,73,0,1,10,63,220,11,1,0,0,0,0,0,0,0,0,0,47.3,42.6]
["1300","P",341,4,326,5,2,2,1,0,1,0,0,0,0,0,0,90,92,84,75,0,1,2,53,189,93,3,0,0,0,0,0,0,0,0,0,52.4,46.2]
["1400","S",293,6,277,5,4,0,1,0,0,0,0,0,0,0,0,78,76,67,72,0,0,14,46,221,11,0,0,0,0,0,0,0,0,1,0,47.9,43]
["1400","P",263,4,250,4,1,1,1,2,0,0,0,0,0,0,0,52,71,60,80,0,0,3,36,152,68,3,1,0,0,0,0,0,0,0,0,52.3,46.7]
["1500","S",286,4,276,2,2,0,1,1,0,0,0,0,0,0,0,64,80,77,65,0,2,12,35,226,11,0,0,0,0,0,0,0,0,0,0,47.9,43.4]
["1500","P",308,4,296,3,3,2,0,0,0,0,0,0,0,0,0,89,66,86,67,0,1,6,34,170,91,6,0,0,0,0,0,0,0,0,0,52.9,47]
["1600","S",239,3,232,2,2,0,0,0,0,0,0,0,0,0,0,61,59,64,55,0,0,12,36,171,20,0,0,0,0,0,0,0,0,0,0,49,43.3]
["1600","P",254,4,242,3,2,1,1,0,0,0,0,0,0,0,1,77,68,53,56,0,0,1,28,123,97,5,0,0,0,0,0,0,0,0,0,54.9,48.3]
["1700","S",212,2,207,1,2,0,0,0,0,0,0,0,0,0,0,47,62,53,50,0,0,12,33,156,11,0,0,0,0,0,0,0,0,0,0,48.1,42.9]
["1700","P",240,9,224,4,0,3,0,0,0,0,0,0,0,0,0,70,56,65,49,0,0,2,35,122,78,3,0,0,0,0,0,0,0,0,0,52.9,47]
["1800","S",153,4,146,1,2,0,0,0,0,0,0,0,0,0,0,51,35,37,30,0,0,4,15,111,22,1,0,0,0,0,0,0,0,0,0,50,45.1]
["1800","P",171,4,164,0,1,2,0,0,0,0,0,0,0,0,0,53,47,38,33,0,0,0,11,76,75,8,1,0,0,0,0,0,0,0,0,55.6,49.7]
["1900","S",111,0,107,0,3,1,0,0,0,0,0,0,0,0,0,28,26,33,24,0,1,2,13,88,7,0,0,0,0,0,0,0,0,0,0,47.9,43.5]
["1900","P",133,1,128,0,0,4,0,0,0,0,0,0,0,0,0,37,33,29,34,0,0,1,11,56,58,6,1,0,0,0,0,0,0,0,0,54,48.7]
["2000","S",69,1,66,0,2,0,0,0,0,0,0,0,0,0,0,25,13,18,13,0,0,4,23,40,1,1,0,0,0,0,0,0,0,0,0,47.7,41.4]
["2000","P",112,0,105,1,1,5,0,0,0,0,0,0,0,0,0,38,28,24,22,0,0,0,21,63,25,1,0,1,0,0,0,1,0,0,0,52.7,46]
["2100","S",33,0,32,0,1,0,0,0,0,0,0,0,0,0,0,12,12,4,5,0,0,3,9,19,2,0,0,0,0,0,0,0,0,0,0,46.7,40.799999999999997]
["2100","P",74,0,67,0,0,7,0,0,0,0,0,0,0,0,0,24,17,17,16,0,0,0,11,52,10,1,0,0,0,0,0,0,0,0,0,50.9,45.5]
["2200","S",14,1,13,0,0,0,0,0,0,0,0,0,0,0,0,5,2,3,4,0,0,2,1,10,1,0,0,0,0,0,0,0,0,0,0,49.5,42.5]
["2200","P",25,0,25,0,0,0,0,0,0,0,0,0,0,0,0,13,5,1,6,0,0,0,3,17,4,0,0,1,0,0,0,0,0,0,0,51.9,46.9]
["2300","S",6,0,6,0,0,0,0,0,0,0,0,0,0,0,0,3,2,1,0,0,0,0,2,2,2,0,0,0,0,0,0,0,0,0,0,0,43.9]
["2300","P",10,1,9,0,0,0,0,0,0,0,0,0,0,0,0,1,3,5,1,0,0,1,2,4,3,0,0,0,0,0,0,0,0,0,0,0,43.3]
["07-19","S",3273,41,3171,26,28,1,2,3,1,0,0,0,0,0,0,825,821,824,803,0,4,152,467,2480,165,4,0,0,0,0,0,0,0,1,0,47.9,43.1]
["07-19","P",2598,39,2468,32,14,34,6,3,1,0,0,0,0,0,1,658,655,640,645,0,3,25,306,1410,806,42,5,0,0,0,0,0,0,1,0,53.1,47.2]
["06-22","S",3539,43,3427,27,34,2,2,3,1,0,0,0,0,0,0,899,883,898,859,0,6,168,516,2656,186,5,1,0,0,0,0,0,0,1,0,47.9,43.1]
["06-22","P",2934,40,2784,33,15,51,6,3,1,0,0,0,0,0,1,757,737,718,722,0,3,26,351,1587,907,50,7,1,0,0,0,1,0,1,0,53.1,47.2]
["06-00","S",3559,44,3446,27,34,2,2,3,1,0,0,0,0,0,0,907,887,902,863,0,6,170,519,2668,189,5,1,0,0,0,0,0,0,1,0,47.9,43.1]
["06-00","P",2969,41,2818,33,15,51,6,3,1,0,0,0,0,0,1,771,745,724,729,0,3,27,356,1608,914,50,7,2,0,0,0,1,0,1,0,53.1,47.2]
["00-00","S",3651,46,3535,27,34,3,2,3,1,0,0,0,0,0,0,928,909,932,882,0,6,180,541,2718,199,5,1,0,0,0,0,0,0,1,0,47.9,43]
["00-00","P",3057,41,2898,33,16,58,6,3,1,0,0,0,0,0,1,797,766,742,752,0,3,28,373,1650,941,50,8,2,0,0,0,1,0,1,0,53.1,47.2]
[]
[]
["Monday, November 4, 2024"]
[]
["Time","Cd","Total","Cls","Cls","Cls","Cls","Cls","Cls","Cls","Cls","Cls","Cls","Cls","Cls","Cls","Cls","Drop","Drop","Drop","Drop","Vbin","Vbin","Vbin","Vbin","Vbin","Vbin","Vbin","Vbin","Vbin","Vbin","Vbin","Vbin","Vbin","Vbin","Vbin","Vbin","Vpp","Mean"]
["[--","","","1","2","3","4","5","6","7","8","9","10","11","12","13","14","--00","--15","--30","--45","0","10","20","30","40","50","60","70","80","90","100","110","120","130","140","150","85",""]
["","","","","","","","","","","","","","","","","","","","","","10","20","30","40","50","60","70","80","90","100","110","120","130","140","150","160","",""]
["0000","S",2,0,2,0,0,0,0,0,0,0,0,0,0,0,0,2,0,0,0,0,0,0,1,1,0,0,0,0,0,0,0,0,0,0,0,0,43.7]
["0000","P",11,0,10,0,0,1,0,0,0,0,0,0,0,0,0,3,4,1,3,0,0,0,0,7,3,1,0,0,0,0,0,0,0,0,0,59.9,50.7]
["0100","S",0,0,0,0,0,0,0,0,0,0,0,0,0,0,0,0,0,0,0,0,0,0,0,0,0,0,0,0,0,0,0,0,0,0,0,0,"-"]
["0100","P",3,0,2,0,1,0,0,0,0,0,0,0,0,0,0,1,0,2,0,0,0,0,1,1,1,0,0,0,0,0,0,0,0,0,0,0,44.7]
["0200","S",3,0,3,0,0,0,0,0,0,0,0,0,0,0,0,0,1,1,1,0,0,0,1,2,0,0,0,0,0,0,0,0,0,0,0,0,43.7]
["0200","P",3,0,3,0,0,0,0,0,0,0,0,0,0,0,0,1,1,0,1,0,0,1,0,2,0,0,0,0,0,0,0,0,0,0,0,0,41.8]
["0300","S",9,0,9,0,0,0,0,0,0,0,0,0,0,0,0,2,1,2,4,0,0,1,3,5,0,0,0,0,0,0,0,0,0,0,0,0,40.700000000000003]
["0300","P",1,0,1,0,0,0,0,0,0,0,0,0,0,0,0,0,0,0,1,0,0,0,0,1,0,0,0,0,0,0,0,0,0,0,0,0,43.9]
["0400","S",29,0,29,0,0,0,0,0,0,0,0,0,0,0,0,5,6,5,13,0,0,2,5,17,5,0,0,0,0,0,0,0,0,0,0,51.6,43.5]
["0400","P",3,0,3,0,0,0,0,0,0,0,0,0,0,0,0,1,0,1,1,0,0,0,0,3,0,0,0,0,0,0,0,0,0,0,0,0,45.3]
["0500","S",187,1,183,0,1,2,0,0,0,0,0,0,0,0,0,24,31,56,76,0,0,10,23,136,18,0,0,0,0,0,0,0,0,0,0,48.4,43.4]
["0500","P",11,0,10,0,0,1,0,0,0,0,0,0,0,0,0,1,4,2,4,0,0,0,2,7,2,0,0,0,0,0,0,0,0,0,0,52.2,45.9]
["0600","S",459,3,436,8,7,5,0,0,0,0,0,0,0,0,0,78,92,135,154,0,0,20,63,349,27,0,0,0,0,0,0,0,0,0,0,48.1,43.4]
["0600","P",45,0,42,1,0,2,0,0,0,0,0,0,0,0,0,9,4,13,19,0,0,1,2,26,14,2,0,0,0,0,0,0,0,0,0,54.6,48.6]
["0700","S",548,6,521,6,8,6,0,0,1,0,0,0,0,0,0,140,128,130,150,0,0,26,70,432,20,0,0,0,0,0,0,0,0,0,0,47.3,42.9]
["0700","P",120,1,105,1,4,8,0,0,1,0,0,0,0,0,0,23,22,35,40,0,0,3,7,74,35,1,0,0,0,0,0,0,0,0,0,53.7,47.6]
["0800","S",642,2,626,6,4,2,0,0,0,0,0,0,0,0,2,123,152,200,167,0,0,24,148,456,14,0,0,0,0,0,0,0,0,0,0,46.3,41.6]
["0800","P",211,3,194,0,2,10,1,0,0,0,0,0,0,0,1,46,58,55,52,0,1,2,16,137,55,0,0,0,0,0,0,0,0,0,0,51.8,46.8]
["0900","S",380,0,367,3,7,1,1,1,0,0,0,0,0,0,0,121,100,78,81,0,2,11,56,298,13,0,0,0,0,0,0,0,0,0,0,47.3,43]
["0900","P",163,1,154,1,2,5,0,0,0,0,0,0,0,0,0,59,40,30,34,0,0,2,28,84,47,2,0,0,0,0,0,0,0,0,0,52.8,46.2]
["1000","S",259,1,240,7,7,1,2,1,0,0,0,0,0,0,0,81,60,64,54,0,2,18,34,195,10,0,0,0,0,0,0,0,0,0,0,47.3,42.3]
["1000","P",156,1,144,0,9,2,0,0,0,0,0,0,0,0,0,36,39,47,34,0,1,3,22,70,56,4,0,0,0,0,0,0,0,0,0,54.5,47.4]
["1100","S",271,5,254,6,3,2,1,0,0,0,0,0,0,0,0,66,60,74,71,0,0,11,41,210,8,1,0,0,0,0,0,0,0,0,0,46.8,42.9]
["1100","P",193,2,177,7,3,3,0,1,0,0,0,0,0,0,0,42,46,47,58,0,0,2,20,97,68,4,0,0,1,1,0,0,0,0,0,54.4,48.2]
["1200","S",245,2,235,5,3,0,0,0,0,0,0,0,0,0,0,73,51,62,59,0,0,5,41,188,11,0,0,0,0,0,0,0,0,0,0,47.3,43.4]
["1200","P",207,2,195,4,2,3,0,1,0,0,0,0,0,0,0,41,54,63,49,0,0,0,17,114,69,7,0,0,0,0,0,0,0,0,0,54.2,48.2]
["1300","S",203,2,195,4,2,0,0,0,0,0,0,0,0,0,0,55,48,46,54,0,0,12,22,157,12,0,0,0,0,0,0,0,0,0,0,47.7,43.1]
["1300","P",198,3,183,5,4,3,0,0,0,0,0,0,0,0,0,42,54,46,56,0,0,2,20,117,58,1,0,0,0,0,0,0,0,0,0,52.9,47.2]
["1400","S",282,3,269,3,3,2,0,2,0,0,0,0,0,0,0,47,59,83,93,0,5,9,45,209,14,0,0,0,0,0,0,0,0,0,0,47,42.4]
["1400","P",322,4,308,3,2,3,1,1,0,0,0,0,0,0,0,72,76,81,93,0,0,3,28,182,106,2,1,0,0,0,0,0,0,0,0,53.1,47.5]
["1500","S",374,1,357,8,5,2,1,0,0,0,0,0,0,0,0,85,110,101,78,0,0,16,75,263,20,0,0,0,0,0,0,0,0,0,0,47.3,42.6]
["1500","P",546,1,524,4,6,7,0,3,0,0,0,0,0,0,1,107,117,156,166,0,0,2,40,349,151,1,1,2,0,0,0,0,0,0,0,52.2,47.3]
["1600","S",307,1,300,3,2,0,0,0,0,0,0,0,0,0,1,90,68,79,70,0,0,11,36,242,16,2,0,0,0,0,0,0,0,0,0,48.2,43.7]
["1600","P",651,6,635,3,2,5,0,0,0,0,0,0,0,0,0,159,147,163,182,0,0,5,53,404,185,4,0,0,0,0,0,0,0,0,0,52.2,47.3]
["1700","S",392,0,386,3,1,1,0,0,0,0,0,0,0,0,1,130,129,77,56,0,0,5,50,302,35,0,0,0,0,0,0,0,0,0,0,48.1,44.1]
["1700","P",677,7,656,3,5,4,1,0,0,1,0,0,0,0,0,171,181,188,137,0,2,8,61,398,200,7,0,0,0,1,0,0,0,0,0,52.7,47.1]
["1800","S",327,3,322,0,1,0,0,0,0,0,0,0,0,0,1,125,80,62,60,0,1,10,34,266,16,0,0,0,0,0,0,0,0,0,0,48.2,43.9]
["1800","P",436,6,416,3,3,6,1,1,0,0,0,0,0,0,0,145,134,92,65,0,0,6,46,240,141,2,1,0,0,0,0,0,0,0,0,52.6,47.3]
["1900","S",215,0,210,1,1,2,0,1,0,0,0,0,0,0,0,96,46,36,37,0,0,7,37,158,13,0,0,0,0,0,0,0,0,0,0,47.4,43]
["1900","P",180,1,168,0,1,10,0,0,0,0,0,0,0,0,0,49,50,44,37,0,0,4,16,101,53,5,0,1,0,0,0,0,0,0,0,53.4,47.6]
["2000","S",94,0,92,1,1,0,0,0,0,0,0,0,0,0,0,36,17,15,26,0,0,2,22,64,6,0,0,0,0,0,0,0,0,0,0,48,42.6]
["2000","P",101,2,93,0,1,5,0,0,0,0,0,0,0,0,0,33,21,24,23,0,0,2,26,43,27,2,1,0,0,0,0,0,0,0,0,53.6,46]
["2100","S",58,1,55,0,2,0,0,0,0,0,0,0,0,0,0,26,13,7,12,0,1,4,9,43,1,0,0,0,0,0,0,0,0,0,0,47.2,41.8]
["2100","P",84,1,77,0,2,4,0,0,0,0,0,0,0,0,0,19,24,22,19,0,0,0,9,43,29,2,0,1,0,0,0,0,0,0,0,54.4,48.7]
["2200","S",23,0,22,0,1,0,0,0,0,0,0,0,0,0,0,9,7,3,4,0,0,1,7,13,2,0,0,0,0,0,0,0,0,0,0,47,42.3]
["2200","P",37,0,33,0,1,2,0,1,0,0,0,0,0,0,0,13,14,5,5,0,0,3,6,17,9,0,2,0,0,0,0,0,0,0,0,52,45.7]
["2300","S",6,0,6,0,0,0,0,0,0,0,0,0,0,0,0,3,1,1,1,0,0,0,0,4,1,1,0,0,0,0,0,0,0,0,0,0,51.3]
["2300","P",20,0,17,1,0,2,0,0,0,0,0,0,0,0,0,7,5,4,4,0,0,1,3,8,8,0,0,0,0,0,0,0,0,0,0,56.5,46.6]
["07-19","S",4230,26,4072,54,46,17,5,4,1,0,0,0,0,0,5,1136,1045,1056,993,0,10,158,652,3218,189,3,0,0,0,0,0,0,0,0,0,47.3,42.9]
["07-19","P",3880,37,3691,34,44,59,4,7,1,1,0,0,0,0,2,943,968,1003,966,0,4,38,358,2266,1171,35,3,2,1,2,0,0,0,0,0,52.7,47.3]
["06-22","S",5056,30,4865,64,57,24,5,5,1,0,0,0,0,0,5,1372,1213,1249,1222,0,11,191,783,3832,236,3,0,0,0,0,0,0,0,0,0,47.3,42.9]
["06-22","P",4290,41,4071,35,48,80,4,7,1,1,0,0,0,0,2,1053,1067,1106,1064,0,4,45,411,2479,1294,46,4,4,1,2,0,0,0,0,0,52.7,47.3]
["06-00","S",5085,30,4893,64,58,24,5,5,1,0,0,0,0,0,5,1384,1221,1253,1227,0,11,192,790,3849,239,4,0,0,0,0,0,0,0,0,0,47.3,42.9]
["06-00","P",4347,41,4121,36,49,84,4,8,1,1,0,0,0,0,2,1073,1086,1115,1073,0,4,49,420,2504,1311,46,6,4,1,2,0,0,0,0,0,52.7,47.3]
["00-00","S",5315,31,5119,64,59,26,5,5,1,0,0,0,0,0,5,1417,1260,1317,1321,0,11,205,823,4010,262,4,0,0,0,0,0,0,0,0,0,47.5,43]
["00-00","P",4379,41,4150,36,50,86,4,8,1,1,0,0,0,0,2,1080,1095,1121,1083,0,4,50,423,2525,1317,47,6,4,1,2,0,0,0,0,0,52.7,47.3]
[]
[]
["Tuesday, November 5, 2024"]
[]
["Time","Cd","Total","Cls","Cls","Cls","Cls","Cls","Cls","Cls","Cls","Cls","Cls","Cls","Cls","Cls","Cls","Drop","Drop","Drop","Drop","Vbin","Vbin","Vbin","Vbin","Vbin","Vbin","Vbin","Vbin","Vbin","Vbin","Vbin","Vbin","Vbin","Vbin","Vbin","Vbin","Vpp","Mean"]
["[--","","","1","2","3","4","5","6","7","8","9","10","11","12","13","14","--00","--15","--30","--45","0","10","20","30","40","50","60","70","80","90","100","110","120","130","140","150","85",""]
["","","","","","","","","","","","","","","","","","","","","","10","20","30","40","50","60","70","80","90","100","110","120","130","140","150","160","",""]
["0000","S",4,0,4,0,0,0,0,0,0,0,0,0,0,0,0,2,1,1,0,0,0,0,1,3,0,0,0,0,0,0,0,0,0,0,0,0,42.7]
["0000","P",8,0,8,0,0,0,0,0,0,0,0,0,0,0,0,3,1,2,2,0,0,0,1,4,3,0,0,0,0,0,0,0,0,0,0,0,48.8]
["0100","S",2,0,2,0,0,0,0,0,0,0,0,0,0,0,0,1,0,1,0,0,0,1,0,1,0,0,0,0,0,0,0,0,0,0,0,0,37]
["0100","P",5,0,4,0,0,1,0,0,0,0,0,0,0,0,0,2,1,1,1,0,0,0,2,1,1,0,0,1,0,0,0,0,0,0,0,0,48]
["0200","S",3,0,3,0,0,0,0,0,0,0,0,0,0,0,0,0,2,1,0,0,0,0,0,3,0,0,0,0,0,0,0,0,0,0,0,0,45.6]
["0200","P",3,1,2,0,0,0,0,0,0,0,0,0,0,0,0,1,2,0,0,0,0,0,0,2,0,0,1,0,0,0,0,0,0,0,0,0,57.1]
["0300","S",9,0,8,0,0,1,0,0,0,0,0,0,0,0,0,0,2,3,4,0,0,2,0,6,1,0,0,0,0,0,0,0,0,0,0,0,41.3]
["0300","P",3,0,3,0,0,0,0,0,0,0,0,0,0,0,0,3,0,0,0,0,0,0,1,1,1,0,0,0,0,0,0,0,0,0,0,0,42.7]
["0400","S",38,1,35,0,0,2,0,0,0,0,0,0,0,0,0,2,6,8,22,0,0,2,5,30,1,0,0,0,0,0,0,0,0,0,0,48.5,43]
["0400","P",8,0,7,0,0,1,0,0,0,0,0,0,0,0,0,2,1,3,2,0,0,0,3,3,2,0,0,0,0,0,0,0,0,0,0,0,44.4]
["0500","S",179,2,168,2,1,6,0,0,0,0,0,0,0,0,0,22,28,58,71,0,0,4,33,128,14,0,0,0,0,0,0,0,0,0,0,48.6,43.2]
["0500","P",19,0,19,0,0,0,0,0,0,0,0,0,0,0,0,1,5,5,8,0,0,0,1,11,7,0,0,0,0,0,0,0,0,0,0,55.6,47.9]
["0600","S",491,2,471,3,5,10,0,0,0,0,0,0,0,0,0,79,108,161,143,0,1,21,53,394,22,0,0,0,0,0,0,0,0,0,0,47.9,43.4]
["0600","P",46,0,44,0,0,1,0,0,0,0,0,0,0,0,1,9,9,10,18,0,0,0,1,23,16,5,1,0,0,0,0,0,0,0,0,58.1,50.2]
["0700","S",537,7,508,5,7,7,0,2,0,0,0,0,0,0,1,146,127,121,143,0,0,29,85,401,22,0,0,0,0,0,0,0,0,0,0,47.2,42.6]
["0700","P",97,1,81,1,1,12,0,0,1,0,0,0,0,0,0,17,21,28,31,0,0,1,8,47,40,1,0,0,0,0,0,0,0,0,0,53.4,47.8]
["0800","S",702,3,690,4,3,1,0,1,0,0,0,0,0,0,0,136,171,234,161,0,1,19,114,562,6,0,0,0,0,0,0,0,0,0,0,46,42.4]
["0800","P",213,1,201,0,1,9,0,1,0,0,0,0,0,0,0,37,65,58,53,0,1,5,15,137,52,3,0,0,0,0,0,0,0,0,0,51.6,46.7]
["0900","S",426,2,413,4,6,0,1,0,0,0,0,0,0,0,0,125,128,93,80,0,1,8,62,342,13,0,0,0,0,0,0,0,0,0,0,46.6,42.8]
["0900","P",173,2,164,1,1,5,0,0,0,0,0,0,0,0,0,53,54,30,36,0,1,4,14,91,57,6,0,0,0,0,0,0,0,0,0,53.3,47.7]
["1000","S",263,4,251,1,4,1,1,1,0,0,0,0,0,0,0,62,70,70,61,0,0,9,38,200,16,0,0,0,0,0,0,0,0,0,0,47.7,43.2]
["1000","P",156,2,148,3,3,0,0,0,0,0,0,0,0,0,0,43,31,47,35,0,1,1,24,72,54,3,1,0,0,0,0,0,0,0,0,53.4,47]
["1100","S",266,3,254,2,5,1,1,0,0,0,0,0,0,0,0,64,79,61,62,0,0,11,45,200,9,1,0,0,0,0,0,0,0,0,0,47.2,42.6]
["1100","P",189,0,180,3,5,1,0,0,0,0,0,0,0,0,0,42,46,53,48,0,0,3,16,97,69,4,0,0,0,0,0,0,0,0,0,53.1,47.8]
["1200","S",225,3,215,2,5,0,0,0,0,0,0,0,0,0,0,63,55,49,58,0,0,10,29,176,10,0,0,0,0,0,0,0,0,0,0,47.5,43.1]
["1200","P",194,2,185,2,5,0,0,0,0,0,0,0,0,0,0,43,50,51,50,0,1,1,16,126,46,4,0,0,0,0,0,0,0,0,0,51.1,46.6]
["1300","S",231,3,218,4,5,1,0,0,0,0,0,0,0,0,0,58,51,59,63,0,0,11,34,171,15,0,0,0,0,0,0,0,0,0,0,47.9,43.2]
["1300","P",208,3,196,4,5,0,0,0,0,0,0,0,0,0,0,46,60,41,61,0,1,4,25,113,64,1,0,0,0,0,0,0,0,0,0,52.9,46.8]
["1400","S",277,4,265,2,5,1,0,0,0,0,0,0,0,0,0,44,71,76,86,0,0,12,47,209,8,1,0,0,0,0,0,0,0,0,0,46.8,42.4]
["1400","P",297,2,283,4,6,0,0,0,0,2,0,0,0,0,0,52,60,99,86,0,0,3,34,179,79,2,0,0,0,0,0,0,0,0,0,52.4,46.9]
["1500","S",386,2,372,3,8,0,0,1,0,0,0,0,0,0,0,91,104,105,86,0,0,17,45,308,16,0,0,0,0,0,0,0,0,0,0,47.5,43.2]
["1500","P",478,5,463,1,7,1,0,0,0,0,1,0,0,0,0,96,119,125,138,0,0,9,59,262,146,2,0,0,0,0,0,0,0,0,0,52.7,46.8]
["1600","S",315,3,305,2,3,0,1,0,0,0,0,0,0,0,1,83,76,79,77,0,0,7,33,256,19,0,0,0,0,0,0,0,0,0,0,47.3,44]
["1600","P",622,10,599,4,4,3,0,1,1,0,0,0,0,0,0,136,144,168,174,0,1,6,61,327,221,5,0,1,0,0,0,0,0,0,0,52.9,47.5]
["1700","S",326,4,317,1,0,1,0,1,0,0,0,0,1,0,1,77,101,82,66,0,0,8,23,265,30,0,0,0,0,0,0,0,0,0,0,48.2,44.4]
["1700","P",721,9,702,2,6,1,0,0,0,0,0,0,0,1,0,177,188,173,183,0,1,2,90,426,195,6,1,0,0,0,0,0,0,0,0,52.3,46.6]
["1800","S",292,1,289,0,2,0,0,0,0,0,0,0,0,0,0,84,89,73,46,0,0,6,37,236,13,0,0,0,0,0,0,0,0,0,0,47.5,43.7]
["1800","P",458,3,443,0,4,7,0,0,1,0,0,0,0,0,0,153,127,94,84,0,0,6,43,266,138,5,0,0,0,0,0,0,0,0,0,52.9,47.2]
["1900","S",172,0,170,0,2,0,0,0,0,0,0,0,0,0,0,50,63,33,26,0,0,10,27,114,21,0,0,0,0,0,0,0,0,0,0,49,43.2]
["1900","P",198,5,187,0,2,4,0,0,0,0,0,0,0,0,0,67,57,40,34,0,0,1,18,98,75,3,1,0,1,0,1,0,0,0,0,54.5,49.1]
["2000","S",92,1,90,0,1,0,0,0,0,0,0,0,0,0,0,29,19,19,25,0,0,4,19,60,9,0,0,0,0,0,0,0,0,0,0,48.6,42.7]
["2000","P",128,4,117,0,1,6,0,0,0,0,0,0,0,0,0,34,29,31,34,0,0,3,15,83,25,1,0,1,0,0,0,0,0,0,0,51,46]
["2100","S",90,0,88,0,2,0,0,0,0,0,0,0,0,0,0,28,26,22,14,0,0,7,21,56,6,0,0,0,0,0,0,0,0,0,0,47.3,41.7]
["2100","P",93,1,89,0,0,3,0,0,0,0,0,0,0,0,0,32,21,25,15,0,0,1,12,58,18,1,2,1,0,0,0,0,0,0,0,52,47.1]
["2200","S",19,0,17,1,1,0,0,0,0,0,0,0,0,0,0,5,4,8,2,0,0,2,4,12,1,0,0,0,0,0,0,0,0,0,0,44.6,40]
["2200","P",43,0,38,1,0,4,0,0,0,0,0,0,0,0,0,13,12,13,5,0,0,2,8,19,13,1,0,0,0,0,0,0,0,0,0,52.8,45.8]
["2300","S",5,0,5,0,0,0,0,0,0,0,0,0,0,0,0,1,2,2,0,0,0,0,0,3,1,1,0,0,0,0,0,0,0,0,0,0,50.5]
["2300","P",29,0,29,0,0,0,0,0,0,0,0,0,0,0,0,7,9,6,7,0,0,1,5,13,8,2,0,0,0,0,0,0,0,0,0,56.3,47.1]
["07-19","S",4246,39,4097,30,53,13,4,6,0,0,0,0,1,0,3,1033,1122,1102,989,0,2,147,592,3326,177,2,0,0,0,0,0,0,0,0,0,47.2,43]
["07-19","P",3806,40,3645,25,48,39,0,2,3,2,1,0,0,1,0,895,965,967,979,0,7,45,405,2143,1161,42,2,1,0,0,0,0,0,0,0,52.7,47]
["06-22","S",5091,42,4916,33,63,23,4,6,0,0,0,0,1,0,3,1219,1338,1337,1197,0,3,189,712,3950,235,2,0,0,0,0,0,0,0,0,0,47.3,43]
["06-22","P",4271,50,4082,25,51,53,0,2,3,2,1,0,0,1,1,1037,1081,1073,1080,0,7,50,451,2405,1295,52,6,3,1,0,1,0,0,0,0,52.7,47.1]
["06-00","S",5115,42,4938,34,64,23,4,6,0,0,0,0,1,0,3,1225,1344,1347,1199,0,3,191,716,3965,237,3,0,0,0,0,0,0,0,0,0,47.3,43]
["06-00","P",4343,50,4149,26,51,57,0,2,3,2,1,0,0,1,1,1057,1102,1092,1092,0,7,53,464,2437,1316,55,6,3,1,0,1,0,0,0,0,52.7,47.1]
["00-00","S",5350,45,5158,36,65,32,4,6,0,0,0,0,1,0,3,1252,1383,1419,1296,0,3,200,755,4136,253,3,0,0,0,0,0,0,0,0,0,47.3,43]
["00-00","P",4389,51,4192,26,51,59,0,2,3,2,1,0,0,1,1,1069,1112,1103,1105,0,7,53,472,2459,1330,55,7,4,1,0,1,0,0,0,0,52.7,47.1]
[]
[]
["Virtual Day (7)"]
[]
["Time","Cd","Total","Cls","Cls","Cls","Cls","Cls","Cls","Cls","Cls","Cls","Cls","Cls","Cls","Cls","Cls","Drop","Drop","Drop","Drop","Vbin","Vbin","Vbin","Vbin","Vbin","Vbin","Vbin","Vbin","Vbin","Vbin","Vbin","Vbin","Vbin","Vbin","Vbin","Vbin","Vpp","Mean"]
["[--","","","1","2","3","4","5","6","7","8","9","10","11","12","13","14","--00","--15","--30","--45","0","10","20","30","40","50","60","70","80","90","100","110","120","130","140","150","85",""]
["","","","","","","","","","","","","","","","","","","","","","10","20","30","40","50","60","70","80","90","100","110","120","130","140","150","160","",""]
["0000","S",9,0,9,0,0,0,0,0,0,0,0,0,0,0,0,4,2,3,1,0,0,1,2,5,1,0,0,0,0,0,0,0,0,0,0,0,40.1]
["0000","P",15,0,14,0,0,1,0,0,0,0,0,0,0,0,0,5,4,3,3,0,0,0,2,6,6,0,0,0,0,0,0,0,0,0,0,54,48.2]
["0100","S",4,0,4,0,0,0,0,0,0,0,0,0,0,0,0,1,1,1,1,0,0,0,2,2,0,0,0,0,0,0,0,0,0,0,0,0,38.700000000000003]
["0100","P",9,0,8,0,0,1,0,0,0,0,0,0,0,0,0,4,1,2,2,0,0,0,2,4,2,0,0,0,0,0,0,0,0,0,0,0,46.2]
["0200","S",3,0,3,0,0,0,0,0,0,0,0,0,0,0,0,1,1,1,0,0,0,0,1,2,0,0,0,0,0,0,0,0,0,0,0,0,41.8]
["0200","P",5,0,5,0,0,0,0,0,0,0,0,0,0,0,0,2,2,1,1,0,0,0,1,3,1,0,0,0,0,0,0,0,0,0,0,0,45.4]
["0300","S",9,0,9,0,0,0,0,0,0,0,0,0,0,0,0,2,2,3,2,0,0,1,2,5,1,0,0,0,0,0,0,0,0,0,0,0,40.799999999999997]
["0300","P",5,0,5,0,0,0,0,0,0,0,0,0,0,0,0,2,1,1,1,0,0,1,1,3,1,0,0,0,0,0,0,0,0,0,0,0,43.6]
["0400","S",27,1,26,0,0,0,0,0,0,0,0,0,0,0,0,3,5,8,11,0,0,2,5,17,3,0,0,0,0,0,0,0,0,0,0,49.5,42.9]
["0400","P",6,0,5,0,0,0,0,0,0,0,0,0,0,0,0,1,1,2,2,0,0,0,2,2,1,0,0,0,0,0,0,0,0,0,0,0,44.4]
["0500","S",138,1,134,1,1,2,0,0,0,0,0,0,0,0,0,17,24,44,54,0,0,7,20,99,13,0,0,0,0,0,0,0,0,0,0,48.6,43.5]
["0500","P",13,0,12,0,0,1,0,0,0,0,0,0,0,0,0,2,4,2,5,0,0,0,1,8,4,0,0,0,0,0,0,0,0,0,0,54.5,47.4]
["0600","S",353,3,339,3,4,3,0,0,0,0,0,0,0,0,0,61,70,107,114,0,0,19,43,267,23,0,0,0,0,0,0,0,0,0,0,48.2,43.3]
["0600","P",38,0,36,1,0,2,0,0,0,0,0,0,0,0,0,7,7,10,15,0,0,0,3,18,14,3,0,0,0,0,0,0,0,0,0,56.6,49.1]
["0700","S",425,4,406,4,6,4,0,0,0,0,0,0,0,0,0,107,102,99,116,0,0,20,61,323,21,0,0,0,0,0,0,0,0,0,0,47.7,43.1]
["0700","P",89,1,79,1,2,6,0,0,0,0,0,0,0,0,0,15,20,24,30,0,0,1,6,48,31,2,0,0,0,0,0,0,0,0,0,53.5,47.9]
["0800","S",568,4,554,4,4,1,0,1,0,0,0,0,0,0,0,114,135,171,147,0,0,21,91,440,16,0,0,0,0,0,0,0,0,0,0,46.8,42.6]
["0800","P",181,1,168,1,2,9,0,0,0,0,0,0,0,0,0,34,52,49,46,0,1,2,15,115,47,2,0,0,0,0,0,0,0,0,0,52.2,46.9]
["0900","S",396,2,382,5,5,0,0,1,0,0,0,0,0,0,0,108,109,91,88,0,1,11,57,311,15,0,0,0,0,0,0,0,0,0,0,47.3,43.1]
["0900","P",163,1,153,1,1,5,0,1,0,0,0,0,0,0,0,41,44,37,41,0,1,2,18,87,53,3,0,0,0,0,0,0,0,0,0,53.1,47.3]
["1000","S",333,3,319,4,5,1,1,0,0,0,0,0,0,0,0,91,84,80,78,0,1,15,48,255,14,0,0,0,0,0,0,0,0,0,0,47.5,42.8]
["1000","P",179,1,169,2,4,3,0,0,0,0,0,0,0,0,0,43,42,46,49,0,0,2,20,94,58,3,0,0,0,0,0,0,0,0,0,53.3,47.2]
["1100","S",305,2,295,3,3,1,0,0,0,0,0,0,0,0,0,80,82,70,73,0,1,12,43,237,12,0,0,0,0,0,0,0,0,0,0,47.3,42.9]
["1100","P",203,2,192,4,3,2,0,1,0,0,0,0,0,0,0,49,48,50,56,0,0,2,22,111,64,3,0,0,0,0,0,0,0,0,0,53.1,47.3]
["1200","S",277,2,266,5,4,0,0,0,0,0,0,0,0,0,0,72,71,70,63,0,0,10,40,214,12,0,0,0,0,0,0,0,0,0,0,47.5,43.1]
["1200","P",239,2,225,4,4,4,0,0,0,0,0,0,0,0,0,58,62,59,60,0,0,3,26,131,74,5,1,0,0,0,0,0,0,0,0,53.3,47.2]
["1300","S",250,2,240,4,4,1,0,0,0,0,0,0,0,0,0,63,58,66,63,0,0,10,38,187,15,0,0,0,0,0,0,0,0,0,0,47.9,43.2]
["1300","P",245,3,231,4,3,3,0,0,0,0,0,0,0,0,0,58,60,61,65,0,0,2,28,136,75,3,0,0,0,0,0,0,0,0,0,53.1,47.2]
["1400","S",295,3,283,3,4,1,1,1,0,0,0,0,0,0,0,60,67,77,91,0,1,12,45,222,14,0,0,0,0,0,0,0,0,0,0,47.5,42.7]
["1400","P",316,3,301,4,3,4,1,0,0,0,0,0,0,0,0,68,73,87,88,0,0,3,31,179,98,4,0,0,0,0,0,0,0,0,0,52.9,47.3]
["1500","S",363,3,349,3,6,1,0,1,0,0,0,0,0,0,0,82,98,100,83,0,1,14,57,275,16,0,0,0,0,0,0,0,0,0,0,47.5,42.9]
["1500","P",454,3,438,3,3,6,0,0,0,0,0,0,0,0,0,103,109,120,123,0,0,7,47,264,131,4,1,1,0,0,0,0,0,0,0,52.4,46.9]
["1600","S",326,2,317,2,2,0,1,1,0,0,0,0,0,0,0,82,80,79,84,0,0,11,44,253,17,0,0,0,0,0,0,0,0,0,0,47.9,43.4]
["1600","P",553,5,532,3,3,8,0,1,0,0,0,0,0,0,0,128,132,141,151,0,1,6,50,327,165,4,0,0,0,0,0,0,0,0,0,52.4,47.3]
["1700","S",313,2,306,2,1,1,0,0,0,0,0,0,0,0,0,82,89,71,71,0,0,8,38,242,25,0,0,0,0,0,0,0,0,0,0,48.4,43.9]
["1700","P",563,6,542,3,4,6,1,0,0,0,0,0,0,0,0,146,146,141,131,0,1,4,57,335,159,6,0,0,0,0,0,0,0,0,0,52.6,47]
["1800","S",268,2,262,1,2,0,0,0,0,0,0,0,0,0,0,80,71,65,52,0,0,8,28,211,20,0,0,0,0,0,0,0,0,0,0,48.4,44.1]
["1800","P",350,4,335,1,2,6,1,1,0,0,0,0,0,0,0,109,100,78,63,0,0,4,37,183,119,7,1,0,0,0,0,0,0,0,0,53.3,47.7]
["1900","S",167,1,163,1,2,1,0,0,0,0,0,0,0,0,0,54,43,36,35,0,0,6,27,123,10,0,0,0,0,0,0,0,0,0,0,47.9,43.1]
["1900","P",179,3,169,0,1,5,0,0,0,0,0,0,0,0,0,55,48,40,36,0,0,1,16,92,64,4,1,0,0,0,0,0,0,0,0,54,48.5]
["2000","S",112,1,109,0,2,0,0,0,0,0,0,0,0,0,0,35,29,21,28,0,0,6,28,74,4,0,0,0,0,0,0,0,0,0,0,46.8,41.8]
["2000","P",120,1,112,0,1,5,0,0,0,0,0,0,0,0,0,36,28,28,28,0,0,2,23,68,25,1,0,0,0,0,0,0,0,0,0,51.8,45.5]
["2100","S",63,0,61,0,2,0,0,0,0,0,0,0,0,0,0,23,17,13,11,0,0,4,12,43,3,0,0,0,0,0,0,0,0,0,0,47.2,41.9]
["2100","P",90,1,84,0,1,4,0,0,0,0,0,0,0,0,0,28,22,21,20,0,0,1,13,54,20,2,1,0,0,0,0,0,0,0,0,52.2,46.4]
["2200","S",28,0,26,0,1,0,0,0,0,0,0,0,0,0,0,10,6,6,5,0,0,2,6,18,2,0,0,0,0,0,0,0,0,0,0,47.5,42.1]
["2200","P",54,0,49,0,1,4,0,0,0,0,0,0,0,0,0,19,14,12,8,0,0,2,6,32,12,1,0,0,0,0,0,0,0,0,0,52,46.1]
["2300","S",13,0,13,0,0,0,0,0,0,0,0,0,0,0,0,4,4,3,3,0,0,1,1,10,2,0,0,0,0,0,0,0,0,0,0,50.4,45.2]
["2300","P",29,0,27,0,0,1,0,0,0,0,0,0,0,0,0,8,8,6,7,0,0,1,6,13,9,1,0,0,0,0,0,0,0,0,0,54.5,46.4]
["07-19","S",4118,30,3978,40,46,12,4,6,1,0,0,0,0,0,2,1023,1046,1039,1010,0,6,154,588,3170,197,2,0,0,0,0,0,0,0,0,0,47.5,43.1]
["07-19","P",3537,34,3366,28,35,62,4,4,2,1,0,0,0,0,1,852,888,894,903,0,6,39,357,2010,1072,46,4,1,0,0,0,0,0,0,0,52.9,47.2]
["06-22","S",4814,35,4649,44,56,16,4,6,1,0,0,0,0,0,2,1196,1205,1215,1197,0,7,188,699,3677,239,3,0,0,0,0,0,0,0,0,0,47.7,43.1]
["06-22","P",3965,40,3767,30,38,78,4,4,2,1,0,0,0,0,2,978,993,992,1003,0,7,44,412,2241,1196,55,7,2,1,0,0,0,0,0,0,52.9,47.2]
["06-00","S",4855,36,4689,44,57,16,4,6,1,0,0,0,0,0,2,1210,1215,1224,1205,0,7,190,706,3705,242,4,0,0,0,0,0,0,0,0,0,47.7,43.1]
["06-00","P",4049,41,3843,30,39,83,4,4,2,1,0,0,0,0,2,1005,1015,1011,1018,0,7,47,424,2286,1217,57,7,2,1,0,0,0,0,0,0,52.9,47.2]
["00-00","S",5045,38,4873,45,57,18,4,6,1,0,0,0,0,0,2,1237,1250,1285,1274,0,8,201,738,3834,260,4,0,0,0,0,0,0,0,0,0,47.7,43.1]
["00-00","P",4102,41,3891,30,39,87,4,4,2,1,0,0,0,0,2,1021,1027,1022,1032,0,7,48,433,2313,1231,58,7,2,1,0,0,0,0,0,0,52.9,47.2]
[]
[]
["Virtual Week (1)"]
[]
["Time","Cd","Total","Cls","Cls","Cls","Cls","Cls","Cls","Cls","Cls","Cls","Cls","Cls","Cls","Cls","Cls","Drop","Drop","Drop","Drop","Vbin","Vbin","Vbin","Vbin","Vbin","Vbin","Vbin","Vbin","Vbin","Vbin","Vbin","Vbin","Vbin","Vbin","Vbin","Vbin","Vpp","Mean"]
["[--","","","1","2","3","4","5","6","7","8","9","10","11","12","13","14","--00","--15","--30","--45","0","10","20","30","40","50","60","70","80","90","100","110","120","130","140","150","85",""]
["","","","","","","","","","","","","","","","","","","","","","10","20","30","40","50","60","70","80","90","100","110","120","130","140","150","160","",""]
["Mon","S",5315,31,5119,64,59,26,5,5,1,0,0,0,0,0,5,1417,1260,1317,1321,0,11,205,823,4010,262,4,0,0,0,0,0,0,0,0,0,47.5,43]
["Mon","P",4379,41,4150,36,50,86,4,8,1,1,0,0,0,0,2,1080,1095,1121,1083,0,4,50,423,2525,1317,47,6,4,1,2,0,0,0,0,0,52.7,47.3]
["Tue","S",5350,45,5158,36,65,32,4,6,0,0,0,0,1,0,3,1252,1383,1419,1296,0,3,200,755,4136,253,3,0,0,0,0,0,0,0,0,0,47.3,43]
["Tue","P",4389,51,4192,26,51,59,0,2,3,2,1,0,0,1,1,1069,1112,1103,1105,0,7,53,472,2459,1330,55,7,4,1,0,1,0,0,0,0,52.7,47.1]
["Wed","S",5599,26,5445,31,65,17,4,9,1,0,0,0,0,0,1,1347,1377,1472,1403,0,8,220,807,4288,272,4,0,0,0,0,0,0,0,0,0,47.7,43.1]
["Wed","P",4312,21,4076,15,39,143,4,8,4,1,0,0,0,0,1,1055,1094,1069,1094,0,6,48,477,2508,1203,61,7,0,0,0,1,0,1,0,0,52.6,47]
["Thu","S",5604,34,5427,46,66,18,6,6,1,0,0,0,0,0,0,1332,1419,1449,1404,0,13,206,843,4213,325,4,0,0,0,0,0,0,0,0,0,47.9,43.2]
["Thu","P",4753,38,4511,44,44,101,3,5,2,1,1,0,0,0,3,1170,1208,1201,1174,0,4,64,463,2766,1380,63,6,4,2,1,0,0,0,0,0,52.7,47.2]
["Fri","S",5582,45,5372,58,68,23,6,7,1,0,0,0,0,1,1,1344,1328,1412,1498,0,8,197,782,4305,288,2,0,0,0,0,0,0,0,0,0,47.7,43.2]
["Fri","P",4532,46,4303,25,52,93,5,3,2,1,0,0,0,0,2,1122,1124,1105,1181,0,12,58,443,2531,1410,71,6,1,0,0,0,0,0,0,0,52.9,47.3]
["|Sat","S",4215,37,4056,55,45,7,4,8,0,0,0,0,0,0,3,1037,1075,991,1112,0,7,200,615,3170,219,3,1,0,0,0,0,0,0,0,0,47.9,43]
["|Sat","P",3290,49,3108,31,22,72,4,2,1,0,0,0,0,0,1,851,791,810,838,0,13,34,383,1749,1035,61,12,1,2,0,0,0,0,0,0,53.5,47.2]
["|Sun","S",3651,46,3535,27,34,3,2,3,1,0,0,0,0,0,0,928,909,932,882,0,6,180,541,2718,199,5,1,0,0,0,0,0,0,1,0,47.9,43]
["|Sun","P",3057,41,2898,33,16,58,6,3,1,0,0,0,0,0,1,797,766,742,752,0,3,28,373,1650,941,50,8,2,0,0,0,1,0,1,0,53.1,47.2]
["--","S",35316,264,34112,317,402,126,31,44,5,0,0,0,1,1,13,8657,8751,8992,8916,0,56,1408,5166,26840,1818,25,2,0,0,0,0,0,0,1,0,47.7,43.1]
["--","P",28712,287,27238,210,274,612,26,31,14,6,2,0,0,1,11,7144,7190,7151,7227,0,49,335,3034,16188,8616,408,52,16,6,3,2,1,1,1,0,52.9,47.2]
[]
[]
["Grand Total"]
[]
["Time","Cd","Total","Cls","Cls","Cls","Cls","Cls","Cls","Cls","Cls","Cls","Cls","Cls","Cls","Cls","Cls","Drop","Drop","Drop","Drop","Vbin","Vbin","Vbin","Vbin","Vbin","Vbin","Vbin","Vbin","Vbin","Vbin","Vbin","Vbin","Vbin","Vbin","Vbin","Vbin","Vpp","Mean"]
["[--","","","1","2","3","4","5","6","7","8","9","10","11","12","13","14","--00","--15","--30","--45","0","10","20","30","40","50","60","70","80","90","100","110","120","130","140","150","85",""]
["","","","","","","","","","","","","","","","","","","","","","10","20","30","40","50","60","70","80","90","100","110","120","130","140","150","160","",""]
["--","S",35316,264,34112,317,402,126,31,44,5,0,0,0,1,1,13,8657,8751,8992,8916,0,56,1408,5166,26840,1818,25,2,0,0,0,0,0,0,1,0,47.7,43.1]
["--","P",28712,287,27238,210,274,612,26,31,14,6,2,0,0,1,11,7144,7190,7151,7227,0,49,335,3034,16188,8616,408,52,16,6,3,2,1,1,1,0,52.9,47.2]

{"sheet":"Input2","index":3,"n_rows":0,"n_cols":0,"rows_kept":0,"cut":false,"hidden":true,"merged":[]}

{"sheet":"Peaks","index":4,"n_rows":60,"n_cols":31,"rows_kept":60,"cut":false,"hidden":false,"merged":[[1,20,1,26],[1,28,1,30],[20,1,39,1],[41,1,59,1],[1,4,1,10],[1,12,1,18],[3,1,18,1]]}
[]
[null,null,null,null,{"$f":"IF(Input2!$A$1=\"\",\"Direction 1\",\"Direction 1 / Lane1\")","v":"Direction 1"},null,null,null,null,null,null,null,{"$f":"IF(Input2!$A$1=\"\",\"Direction 2\",\"Direction 1 / Lane2\")","v":"Direction 2"},null,null,null,null,null,null,null,{"$f":"IF(Input2!$A$1=\"\",\"Both Directions\",\"Direction 1 / Both Lanes\")","v":"Both Directions"},null,null,null,null,null,null,null,"Daily Maximums"]
[null,null,null,null,{"$f":"LEFT(Input!$A$10,3)","v":"Wed"},{"$f":"LEFT(Input!$A$73,3)","v":"Thu"},{"$f":"LEFT(Input!$A$136,3)","v":"Fri"},{"$f":"LEFT(Input!$A$199,3)","v":"Sat"},{"$f":"LEFT(Input!$A$262,3)","v":"Sun"},{"$f":"LEFT(Input!$A$325,3)","v":"Mon"},{"$f":"LEFT(Input!$A$388,3)","v":"Tue"},null,{"$f":"LEFT(Input!$A$10,3)","v":"Wed"},{"$f":"LEFT(Input!$A$73,3)","v":"Thu"},{"$f":"LEFT(Input!$A$136,3)","v":"Fri"},{"$f":"LEFT(Input!$A$199,3)","v":"Sat"},{"$f":"LEFT(Input!$A$262,3)","v":"Sun"},{"$f":"LEFT(Input!$A$325,3)","v":"Mon"},{"$f":"LEFT(Input!$A$388,3)","v":"Tue"},null,{"$f":"LEFT(Input!$A$10,3)","v":"Wed"},{"$f":"LEFT(Input!$A$73,3)","v":"Thu"},{"$f":"LEFT(Input!$A$136,3)","v":"Fri"},{"$f":"LEFT(Input!$A$199,3)","v":"Sat"},{"$f":"LEFT(Input!$A$262,3)","v":"Sun"},{"$f":"LEFT(Input!$A$325,3)","v":"Mon"},{"$f":"LEFT(Input!$A$388,3)","v":"Tue"},null,{"$f":"IF(Input2!$A$1=\"\",\"Direction 1\",\"Dir1/Lane1\")","v":"Direction 1"},{"$f":"IF(Input2!$A$1=\"\",\"Direction 2\",\"Dir1/Lane2\")","v":"Direction 2"},{"$f":"IF(Input2!$A$1=\"\",\"Both\",\"Dir1/Both\")","v":"Both"}]
[null,"Morning","0515","0615",{"$f":"SUM(Input!$S$26:$U$26,Input!$R$28)","v":13},{"$f":"SUM(Input!$S$89:$U$89,Input!$R$91)","v":17},{"$f":"SUM(Input!$S$152:$U$152,Input!$R$154)","v":31},{"$f":"SUM(Input!$S$215:$U$215,Input!$R$217)","v":14},{"$f":"SUM(Input!$S$278:$U$278,Input!$R$280)","v":5},{"$f":"SUM(Input!$S$341:$U$341,Input!$R$343)","v":19},{"$f":"SUM(Input!$S$404:$U$404,Input!$R$406)","v":27},null,{"$f":"SUM(Input!$S$25:$U$25,Input!$R$27)","v":250},{"$f":"SUM(Input!$S$88:$U$88,Input!$R$90)","v":231},{"$f":"SUM(Input!$S$151:$U$151,Input!$R$153)","v":231},{"$f":"SUM(Input!$S$214:$U$214,Input!$R$216)","v":58},{"$f":"SUM(Input!$S$277:$U$277,Input!$R$279)","v":31},{"$f":"SUM(Input!$S$340:$U$340,Input!$R$342)","v":241},{"$f":"SUM(Input!$S$403:$U$403,Input!$R$405)","v":236},null,{"$f":"E4+M4","v":263},{"$f":"F4+N4","v":248},{"$f":"G4+O4","v":262},{"$f":"H4+P4","v":72},{"$f":"I4+Q4","v":36},{"$f":"J4+R4","v":260},{"$f":"K4+S4","v":263},null,{"$f":"MAX(E4:K4)","v":31},{"$f":"MAX(M4:S4)","v":250},{"$f":"MAX(U4:AA4)","v":263}]
[null,null,"0530","0630",{"$f":"SUM(Input!$T$26:$U$26,Input!$R$28:$S$28)","v":15},{"$f":"SUM(Input!$T$89:$U$89,Input!$R$91:$S$91)","v":22},{"$f":"SUM(Input!$T$152:$U$152,Input!$R$154:$S$154)","v":35},{"$f":"SUM(Input!$T$215:$U$215,Input!$R$217:$S$217)","v":18},{"$f":"SUM(Input!$T$278:$U$278,Input!$R$280:$S$280)","v":7},{"$f":"SUM(Input!$T$341:$U$341,Input!$R$343:$S$343)","v":19},{"$f":"SUM(Input!$T$404:$U$404,Input!$R$406:$S$406)","v":31},null,{"$f":"SUM(Input!$T$25:$U$25,Input!$R$27:$S$27)","v":301},{"$f":"SUM(Input!$T$88:$U$88,Input!$R$90:$S$90)","v":302},{"$f":"SUM(Input!$T$151:$U$151,Input!$R$153:$S$153)","v":271},{"$f":"SUM(Input!$T$214:$U$214,Input!$R$216:$S$216)","v":74},{"$f":"SUM(Input!$T$277:$U$277,Input!$R$279:$S$279)","v":38},{"$f":"SUM(Input!$T$340:$U$340,Input!$R$342:$S$342)","v":302},{"$f":"SUM(Input!$T$403:$U$403,Input!$R$405:$S$405)","v":316},null,316,324,306,92,45,321,347,null,35,316,{"$f":"MAX(U5:AA5)","v":347}]
[null,null,"0545","0645",{"$f":"SUM(Input!$U$26,Input!$R$28:$T$28)","v":26},{"$f":"SUM(Input!$U$89,Input!$R$91:$T$91)","v":29},{"$f":"SUM(Input!$U$152,Input!$R$154:$T$154)","v":40},{"$f":"SUM(Input!$U$215,Input!$R$217:$T$217)","v":24},{"$f":"SUM(Input!$U$278,Input!$R$280:$T$280)","v":14},{"$f":"SUM(Input!$U$341,Input!$R$343:$T$343)","v":30},{"$f":"SUM(Input!$U$404,Input!$R$406:$T$406)","v":36},null,{"$f":"SUM(Input!$U$25,Input!$R$27:$T$27)","v":381},{"$f":"SUM(Input!$U$88,Input!$R$90:$T$90)","v":394},{"$f":"SUM(Input!$U$151,Input!$R$153:$T$153)","v":343},{"$f":"SUM(Input!$U$214,Input!$R$216:$T$216)","v":83},{"$f":"SUM(Input!$U$277,Input!$R$279:$T$279)","v":47},{"$f":"SUM(Input!$U$340,Input!$R$342:$T$342)","v":381},{"$f":"SUM(Input!$U$403,Input!$R$405:$T$405)","v":419},null,407,423,383,107,61,411,455,null,40,419,455]
[null,null,"0600","0700",{"$f":"SUM(Input!$R$28:$U$28)","v":42},{"$f":"SUM(Input!$R$91:$U$91)","v":41},{"$f":"SUM(Input!$R$154:$U$154)","v":54},{"$f":"SUM(Input!$R$217:$U$217)","v":24},{"$f":"SUM(Input!$R$280:$U$280)","v":17},{"$f":"SUM(Input!$R$343:$U$343)","v":45},{"$f":"SUM(Input!$R$406:$U$406)","v":46},null,{"$f":"SUM(Input!$R$27:$U$27)","v":454},{"$f":"SUM(Input!$R$90:$U$90)","v":491},{"$f":"SUM(Input!$R$153:$U$153)","v":424},{"$f":"SUM(Input!$R$216:$U$216)","v":97},{"$f":"SUM(Input!$R$279:$U$279)","v":53},{"$f":"SUM(Input!$R$342:$U$342)","v":459},{"$f":"SUM(Input!$R$405:$U$405)","v":491},null,496,532,478,121,70,504,537,null,54,491,537]
[null,null,"0615","0715",{"$f":"SUM(Input!$S$28:$U$28,Input!$R$30)","v":51},{"$f":"SUM(Input!$S$91:$U$91,Input!$R$93)","v":52},{"$f":"SUM(Input!$S$154:$U$154,Input!$R$156)","v":62},{"$f":"SUM(Input!$S$217:$U$217,Input!$R$219)","v":32},{"$f":"SUM(Input!$S$280:$U$280,Input!$R$282)","v":19},{"$f":"SUM(Input!$S$343:$U$343,Input!$R$345)","v":59},{"$f":"SUM(Input!$S$406:$U$406,Input!$R$408)","v":54},null,{"$f":"SUM(Input!$S$27:$U$27,Input!$R$29)","v":525},{"$f":"SUM(Input!$S$90:$U$90,Input!$R$92)","v":546},{"$f":"SUM(Input!$S$153:$U$153,Input!$R$155)","v":492},{"$f":"SUM(Input!$S$216:$U$216,Input!$R$218)","v":91},{"$f":"SUM(Input!$S$279:$U$279,Input!$R$281)","v":62},{"$f":"SUM(Input!$S$342:$U$342,Input!$R$344)","v":521},{"$f":"SUM(Input!$S$405:$U$405,Input!$R$407)","v":558},null,576,598,554,123,81,580,612,null,62,558,612]
[null,null,"0630","0730",{"$f":"SUM(Input!$T$28:$U$28,Input!$R$30:$S$30)","v":66},{"$f":"SUM(Input!$T$91:$U$91,Input!$R$93:$S$93)","v":62},{"$f":"SUM(Input!$T$154:$U$154,Input!$R$156:$S$156)","v":79},{"$f":"SUM(Input!$T$217:$U$217,Input!$R$219:$S$219)","v":41},{"$f":"SUM(Input!$T$280:$U$280,Input!$R$282:$S$282)","v":28},{"$f":"SUM(Input!$T$343:$U$343,Input!$R$345:$S$345)","v":77},{"$f":"SUM(Input!$T$406:$U$406,Input!$R$408:$S$408)","v":66},null,{"$f":"SUM(Input!$T$27:$U$27,Input!$R$29:$S$29)","v":569},{"$f":"SUM(Input!$T$90:$U$90,Input!$R$92:$S$92)","v":595},{"$f":"SUM(Input!$T$153:$U$153,Input!$R$155:$S$155)","v":541},{"$f":"SUM(Input!$T$216:$U$216,Input!$R$218:$S$218)","v":103},{"$f":"SUM(Input!$T$279:$U$279,Input!$R$281:$S$281)","v":73},{"$f":"SUM(Input!$T$342:$U$342,Input!$R$344:$S$344)","v":557},{"$f":"SUM(Input!$T$405:$U$405,Input!$R$407:$S$407)","v":577},null,635,657,620,144,101,634,643,null,79,595,657]
[null,null,"0645","0745",{"$f":"SUM(Input!$U$28,Input!$R$30:$T$30)","v":81},{"$f":"SUM(Input!$U$91,Input!$R$93:$T$93)","v":85},{"$f":"SUM(Input!$U$154,Input!$R$156:$T$156)","v":99},{"$f":"SUM(Input!$U$217,Input!$R$219:$T$219)","v":45},{"$f":"SUM(Input!$U$280,Input!$R$282:$T$282)","v":27},{"$f":"SUM(Input!$U$343,Input!$R$345:$T$345)","v":99},{"$f":"SUM(Input!$U$406,Input!$R$408:$T$408)","v":84},null,{"$f":"SUM(Input!$U$27,Input!$R$29:$T$29)","v":546},{"$f":"SUM(Input!$U$90,Input!$R$92:$T$92)","v":568},{"$f":"SUM(Input!$U$153,Input!$R$155:$T$155)","v":537},{"$f":"SUM(Input!$U$216,Input!$R$218:$T$218)","v":132},{"$f":"SUM(Input!$U$279,Input!$R$281:$T$281)","v":85},{"$f":"SUM(Input!$U$342,Input!$R$344:$T$344)","v":552},{"$f":"SUM(Input!$U$405,Input!$R$407:$T$407)","v":537},null,627,653,636,177,112,651,621,null,99,568,653]
[null,null,"0700","0800",{"$f":"SUM(Input!$R$30:$U$30)","v":103},{"$f":"SUM(Input!$R$93:$U$93)","v":99},{"$f":"SUM(Input!$R$156:$U$156)","v":108},{"$f":"SUM(Input!$R$219:$U$219)","v":56},{"$f":"SUM(Input!$R$282:$U$282)","v":40},{"$f":"SUM(Input!$R$345:$U$345)","v":120},{"$f":"SUM(Input!$R$408:$U$408)","v":97},null,{"$f":"SUM(Input!$R$29:$U$29)","v":547},{"$f":"SUM(Input!$R$92:$U$92)","v":540},{"$f":"SUM(Input!$R$155:$U$155)","v":517},{"$f":"SUM(Input!$R$218:$U$218)","v":181},{"$f":"SUM(Input!$R$281:$U$281)","v":102},{"$f":"SUM(Input!$R$344:$U$344)","v":548},{"$f":"SUM(Input!$R$407:$U$407)","v":537},null,650,639,625,237,142,668,634,null,120,548,668]
[null,null,"0715","0815",{"$f":"SUM(Input!$S$30:$U$30,Input!$R$32)","v":126},{"$f":"SUM(Input!$S$93:$U$93,Input!$R$95)","v":121},{"$f":"SUM(Input!$S$156:$U$156,Input!$R$158)","v":137},{"$f":"SUM(Input!$S$219:$U$219,Input!$R$221)","v":60},{"$f":"SUM(Input!$S$282:$U$282,Input!$R$284)","v":51},{"$f":"SUM(Input!$S$345:$U$345,Input!$R$347)","v":143},{"$f":"SUM(Input!$S$408:$U$408,Input!$R$410)","v":117},null,{"$f":"SUM(Input!$S$29:$U$29,Input!$R$31)","v":545},{"$f":"SUM(Input!$S$92:$U$92,Input!$R$94)","v":532},{"$f":"SUM(Input!$S$155:$U$155,Input!$R$157)","v":516},{"$f":"SUM(Input!$S$218:$U$218,Input!$R$220)","v":224},{"$f":"SUM(Input!$S$281:$U$281,Input!$R$283)","v":145},{"$f":"SUM(Input!$S$344:$U$344,Input!$R$346)","v":531},{"$f":"SUM(Input!$S$407:$U$407,Input!$R$409)","v":527},null,671,653,653,284,196,674,644,null,143,545,674]
[null,null,"0730","0830",{"$f":"SUM(Input!$T$30:$U$30,Input!$R$32:$S$32)","v":172},{"$f":"SUM(Input!$T$93:$U$93,Input!$R$95:$S$95)","v":180},{"$f":"SUM(Input!$T$156:$U$156,Input!$R$158:$S$158)","v":166},{"$f":"SUM(Input!$T$219:$U$219,Input!$R$221:$S$221)","v":67},{"$f":"SUM(Input!$T$282:$U$282,Input!$R$284:$S$284)","v":59},{"$f":"SUM(Input!$T$345:$U$345,Input!$R$347:$S$347)","v":179},{"$f":"SUM(Input!$T$408:$U$408,Input!$R$410:$S$410)","v":161},null,{"$f":"SUM(Input!$T$29:$U$29,Input!$R$31:$S$31)","v":561},{"$f":"SUM(Input!$T$92:$U$92,Input!$R$94:$S$94)","v":567},{"$f":"SUM(Input!$T$155:$U$155,Input!$R$157:$S$157)","v":569},{"$f":"SUM(Input!$T$218:$U$218,Input!$R$220:$S$220)","v":262},{"$f":"SUM(Input!$T$281:$U$281,Input!$R$283:$S$283)","v":168},{"$f":"SUM(Input!$T$344:$U$344,Input!$R$346:$S$346)","v":555},{"$f":"SUM(Input!$T$407:$U$407,Input!$R$409:$S$409)","v":571},null,733,747,735,329,227,734,732,null,180,571,747]
[null,null,"0745","0845",{"$f":"SUM(Input!$U$30,Input!$R$32:$T$32)","v":205},{"$f":"SUM(Input!$U$93,Input!$R$95:$T$95)","v":206},{"$f":"SUM(Input!$U$156,Input!$R$158:$T$158)","v":205},{"$f":"SUM(Input!$U$219,Input!$R$221:$T$221)","v":83},{"$f":"SUM(Input!$U$282,Input!$R$284:$T$284)","v":69},{"$f":"SUM(Input!$U$345,Input!$R$347:$T$347)","v":199},{"$f":"SUM(Input!$U$408,Input!$R$410:$T$410)","v":191},null,{"$f":"SUM(Input!$U$29,Input!$R$31:$T$31)","v":640},{"$f":"SUM(Input!$U$92,Input!$R$94:$T$94)","v":652},{"$f":"SUM(Input!$U$155,Input!$R$157:$T$157)","v":672},{"$f":"SUM(Input!$U$218,Input!$R$220:$T$220)","v":289},{"$f":"SUM(Input!$U$281,Input!$R$283:$T$283)","v":198},{"$f":"SUM(Input!$U$344,Input!$R$346:$T$346)","v":625},{"$f":"SUM(Input!$U$407,Input!$R$409:$T$409)","v":684},null,845,858,877,372,267,824,875,null,206,684,877]
[null,null,"0800","0900",{"$f":"SUM(Input!$R$32:$U$32)","v":223},{"$f":"SUM(Input!$R$95:$U$95)","v":236},{"$f":"SUM(Input!$R$158:$U$158)","v":225},{"$f":"SUM(Input!$R$221:$U$221)","v":94},{"$f":"SUM(Input!$R$284:$U$284)","v":68},{"$f":"SUM(Input!$R$347:$U$347)","v":211},{"$f":"SUM(Input!$R$410:$U$410)","v":213},null,{"$f":"SUM(Input!$R$31:$U$31)","v":656},{"$f":"SUM(Input!$R$94:$U$94)","v":716},{"$f":"SUM(Input!$R$157:$U$157)","v":709},{"$f":"SUM(Input!$R$220:$U$220)","v":321},{"$f":"SUM(Input!$R$283:$U$283)","v":229},{"$f":"SUM(Input!$R$346:$U$346)","v":642},{"$f":"SUM(Input!$R$409:$U$409)","v":702},null,879,952,934,415,297,853,915,null,236,716,952]
[null,null,"0815","0915",{"$f":"SUM(Input!$S$32:$U$32,Input!$R$34)","v":221},{"$f":"SUM(Input!$S$95:$U$95,Input!$R$97)","v":236},{"$f":"SUM(Input!$S$158:$U$158,Input!$R$160)","v":211},{"$f":"SUM(Input!$S$221:$U$221,Input!$R$223)","v":109},{"$f":"SUM(Input!$S$284:$U$284,Input!$R$286)","v":87},{"$f":"SUM(Input!$S$347:$U$347,Input!$R$349)","v":224},{"$f":"SUM(Input!$S$410:$U$410,Input!$R$412)","v":229},null,{"$f":"SUM(Input!$S$31:$U$31,Input!$R$33)","v":620},{"$f":"SUM(Input!$S$94:$U$94,Input!$R$96)","v":708},{"$f":"SUM(Input!$S$157:$U$157,Input!$R$159)","v":678},{"$f":"SUM(Input!$S$220:$U$220,Input!$R$222)","v":355},{"$f":"SUM(Input!$S$283:$U$283,Input!$R$285)","v":238},{"$f":"SUM(Input!$S$346:$U$346,Input!$R$348)","v":640},{"$f":"SUM(Input!$S$409:$U$409,Input!$R$411)","v":691},null,841,944,889,464,325,864,920,null,236,708,944]
[null,null,"0830","0930",{"$f":"SUM(Input!$T$32:$U$32,Input!$R$34:$S$34)","v":189},{"$f":"SUM(Input!$T$95:$U$95,Input!$R$97:$S$97)","v":203},{"$f":"SUM(Input!$T$158:$U$158,Input!$R$160:$S$160)","v":205},{"$f":"SUM(Input!$T$221:$U$221,Input!$R$223:$S$223)","v":135},{"$f":"SUM(Input!$T$284:$U$284,Input!$R$286:$S$286)","v":104},{"$f":"SUM(Input!$T$347:$U$347,Input!$R$349:$S$349)","v":206},{"$f":"SUM(Input!$T$410:$U$410,Input!$R$412:$S$412)","v":218},null,{"$f":"SUM(Input!$T$31:$U$31,Input!$R$33:$S$33)","v":592},{"$f":"SUM(Input!$T$94:$U$94,Input!$R$96:$S$96)","v":658},{"$f":"SUM(Input!$T$157:$U$157,Input!$R$159:$S$159)","v":599},{"$f":"SUM(Input!$T$220:$U$220,Input!$R$222:$S$222)","v":377},{"$f":"SUM(Input!$T$283:$U$283,Input!$R$285:$S$285)","v":288},{"$f":"SUM(Input!$T$346:$U$346,Input!$R$348:$S$348)","v":588},{"$f":"SUM(Input!$T$409:$U$409,Input!$R$411:$S$411)","v":648},null,781,861,804,512,392,794,866,null,218,658,866]
[null,null,"0845","0945",{"$f":"SUM(Input!$U$32,Input!$R$34:$T$34)","v":172},{"$f":"SUM(Input!$U$95,Input!$R$97:$T$97)","v":183},{"$f":"SUM(Input!$U$158,Input!$R$160:$T$160)","v":180},{"$f":"SUM(Input!$U$221,Input!$R$223:$T$223)","v":144},{"$f":"SUM(Input!$U$284,Input!$R$286:$T$286)","v":129},{"$f":"SUM(Input!$U$347,Input!$R$349:$T$349)","v":181},{"$f":"SUM(Input!$U$410,Input!$R$412:$T$412)","v":190},null,{"$f":"SUM(Input!$U$31,Input!$R$33:$T$33)","v":485},{"$f":"SUM(Input!$U$94,Input!$R$96:$T$96)","v":547},{"$f":"SUM(Input!$U$157,Input!$R$159:$T$159)","v":468},{"$f":"SUM(Input!$U$220,Input!$R$222:$T$222)","v":395},{"$f":"SUM(Input!$U$283,Input!$R$285:$T$285)","v":316},{"$f":"SUM(Input!$U$346,Input!$R$348:$T$348)","v":466},{"$f":"SUM(Input!$U$409,Input!$R$411:$T$411)","v":507},null,657,730,648,539,445,647,697,null,190,547,730]
[null,null,"0900",1000,{"$f":"SUM(Input!$R$34:$U$34)","v":155},{"$f":"SUM(Input!$R$97:$U$97)","v":159},{"$f":"SUM(Input!$R$160:$U$160)","v":182},{"$f":"SUM(Input!$R$223:$U$223)","v":159},{"$f":"SUM(Input!$R$286:$U$286)","v":151},{"$f":"SUM(Input!$R$349:$U$349)","v":163},{"$f":"SUM(Input!$R$412:$U$412)","v":173},null,{"$f":"SUM(Input!$R$33:$U$33)","v":395},{"$f":"SUM(Input!$R$96:$U$96)","v":420},{"$f":"SUM(Input!$R$159:$U$159)","v":397},{"$f":"SUM(Input!$R$222:$U$222)","v":401},{"$f":"SUM(Input!$R$285:$U$285)","v":350},{"$f":"SUM(Input!$R$348:$U$348)","v":380},{"$f":"SUM(Input!$R$411:$U$411)","v":426},null,550,579,579,560,501,543,599,null,182,426,599]
[]
[null,"Middle Day","0915",1015,{"$f":"SUM(Input!$S$34:$U$34,Input!$R$36)","v":153},{"$f":"SUM(Input!$S$97:$U$97,Input!$R$99)","v":164},{"$f":"SUM(Input!$S$160:$U$160,Input!$R$162)","v":186},{"$f":"SUM(Input!$S$223:$U$223,Input!$R$225)","v":183},{"$f":"SUM(Input!$S$286:$U$286,Input!$R$288)","v":165},{"$f":"SUM(Input!$S$349:$U$349,Input!$R$351)","v":140},{"$f":"SUM(Input!$S$412:$U$412,Input!$R$414)","v":163},null,{"$f":"SUM(Input!$S$33:$U$33,Input!$R$35)","v":363},{"$f":"SUM(Input!$S$96:$U$96,Input!$R$98)","v":397},{"$f":"SUM(Input!$S$159:$U$159,Input!$R$161)","v":398},{"$f":"SUM(Input!$S$222:$U$222,Input!$R$224)","v":415},{"$f":"SUM(Input!$S$285:$U$285,Input!$R$287)","v":374},{"$f":"SUM(Input!$S$348:$U$348,Input!$R$350)","v":340},{"$f":"SUM(Input!$S$411:$U$411,Input!$R$413)","v":363},null,{"$f":"E21+M21","v":516},{"$f":"F21+N21","v":561},{"$f":"G21+O21","v":584},{"$f":"H21+P21","v":598},{"$f":"I21+Q21","v":539},{"$f":"J21+R21","v":480},{"$f":"K21+S21","v":526},null,{"$f":"MAX(E21:K21)","v":186},{"$f":"MAX(M21:S21)","v":415},{"$f":"MAX(U21:AA21)","v":598}]
[null,null,"0930",1030,{"$f":"SUM(Input!$T$34:$U$34,Input!$R$36:$S$36)","v":154},{"$f":"SUM(Input!$T$97:$U$97,Input!$R$99:$S$99)","v":166},{"$f":"SUM(Input!$T$160:$U$160,Input!$R$162:$S$162)","v":179},{"$f":"SUM(Input!$T$223:$U$223,Input!$R$225:$S$225)","v":178},{"$f":"SUM(Input!$T$286:$U$286,Input!$R$288:$S$288)","v":180},{"$f":"SUM(Input!$T$349:$U$349,Input!$R$351:$S$351)","v":139},{"$f":"SUM(Input!$T$412:$U$412,Input!$R$414:$S$414)","v":140},null,{"$f":"SUM(Input!$T$33:$U$33,Input!$R$35:$S$35)","v":328},{"$f":"SUM(Input!$T$96:$U$96,Input!$R$98:$S$98)","v":342},{"$f":"SUM(Input!$T$159:$U$159,Input!$R$161:$S$161)","v":392},{"$f":"SUM(Input!$T$222:$U$222,Input!$R$224:$S$224)","v":432},{"$f":"SUM(Input!$T$285:$U$285,Input!$R$287:$S$287)","v":373},{"$f":"SUM(Input!$T$348:$U$348,Input!$R$350:$S$350)","v":300},{"$f":"SUM(Input!$T$411:$U$411,Input!$R$413:$S$413)","v":305},null,482,508,571,610,553,439,445,null,180,432,{"$f":"MAX(U22:AA22)","v":610}]
[null,null,"0945",1045,{"$f":"SUM(Input!$U$34,Input!$R$36:$T$36)","v":147},{"$f":"SUM(Input!$U$97,Input!$R$99:$T$99)","v":176},{"$f":"SUM(Input!$U$160,Input!$R$162:$T$162)","v":166},{"$f":"SUM(Input!$U$223,Input!$R$225:$T$225)","v":200},{"$f":"SUM(Input!$U$286,Input!$R$288:$T$288)","v":194},{"$f":"SUM(Input!$U$349,Input!$R$351:$T$351)","v":156},{"$f":"SUM(Input!$U$412,Input!$R$414:$T$414)","v":157},null,{"$f":"SUM(Input!$U$33,Input!$R$35:$T$35)","v":325},{"$f":"SUM(Input!$U$96,Input!$R$98:$T$98)","v":315},{"$f":"SUM(Input!$U$159,Input!$R$161:$T$161)","v":385},{"$f":"SUM(Input!$U$222,Input!$R$224:$T$224)","v":429},{"$f":"SUM(Input!$U$285,Input!$R$287:$T$287)","v":374},{"$f":"SUM(Input!$U$348,Input!$R$350:$T$350)","v":286},{"$f":"SUM(Input!$U$411,Input!$R$413:$T$413)","v":282},null,472,491,551,629,568,442,439,null,200,429,629]
[null,null,1000,1100,{"$f":"SUM(Input!$R$36:$U$36)","v":149},{"$f":"SUM(Input!$R$99:$U$99)","v":183},{"$f":"SUM(Input!$R$162:$U$162)","v":155},{"$f":"SUM(Input!$R$225:$U$225)","v":237},{"$f":"SUM(Input!$R$288:$U$288)","v":215},{"$f":"SUM(Input!$R$351:$U$351)","v":156},{"$f":"SUM(Input!$R$414:$U$414)","v":156},null,{"$f":"SUM(Input!$R$35:$U$35)","v":323},{"$f":"SUM(Input!$R$98:$U$98)","v":317},{"$f":"SUM(Input!$R$161:$U$161)","v":371},{"$f":"SUM(Input!$R$224:$U$224)","v":419},{"$f":"SUM(Input!$R$287:$U$287)","v":378},{"$f":"SUM(Input!$R$350:$U$350)","v":259},{"$f":"SUM(Input!$R$413:$U$413)","v":263},null,472,500,526,656,593,415,419,null,237,419,656]
[null,null,1015,1115,{"$f":"SUM(Input!$S$36:$U$36,Input!$R$38)","v":160},{"$f":"SUM(Input!$S$99:$U$99,Input!$R$101)","v":182},{"$f":"SUM(Input!$S$162:$U$162,Input!$R$164)","v":168},{"$f":"SUM(Input!$S$225:$U$225,Input!$R$227)","v":247},{"$f":"SUM(Input!$S$288:$U$288,Input!$R$290)","v":222},{"$f":"SUM(Input!$S$351:$U$351,Input!$R$353)","v":162},{"$f":"SUM(Input!$S$414:$U$414,Input!$R$416)","v":155},null,{"$f":"SUM(Input!$S$35:$U$35,Input!$R$37)","v":311},{"$f":"SUM(Input!$S$98:$U$98,Input!$R$100)","v":297},{"$f":"SUM(Input!$S$161:$U$161,Input!$R$163)","v":348},{"$f":"SUM(Input!$S$224:$U$224,Input!$R$226)","v":409},{"$f":"SUM(Input!$S$287:$U$287,Input!$R$289)","v":382},{"$f":"SUM(Input!$S$350:$U$350,Input!$R$352)","v":244},{"$f":"SUM(Input!$S$413:$U$413,Input!$R$415)","v":265},null,471,479,516,656,604,406,420,null,247,409,656]
[null,null,1030,1130,{"$f":"SUM(Input!$T$36:$U$36,Input!$R$38:$S$38)","v":157},{"$f":"SUM(Input!$T$99:$U$99,Input!$R$101:$S$101)","v":179},{"$f":"SUM(Input!$T$162:$U$162,Input!$R$164:$S$164)","v":168},{"$f":"SUM(Input!$T$225:$U$225,Input!$R$227:$S$227)","v":272},{"$f":"SUM(Input!$T$288:$U$288,Input!$R$290:$S$290)","v":228},{"$f":"SUM(Input!$T$351:$U$351,Input!$R$353:$S$353)","v":169},{"$f":"SUM(Input!$T$414:$U$414,Input!$R$416:$S$416)","v":170},null,{"$f":"SUM(Input!$T$35:$U$35,Input!$R$37:$S$37)","v":302},{"$f":"SUM(Input!$T$98:$U$98,Input!$R$100:$S$100)","v":300},{"$f":"SUM(Input!$T$161:$U$161,Input!$R$163:$S$163)","v":336},{"$f":"SUM(Input!$T$224:$U$224,Input!$R$226:$S$226)","v":408},{"$f":"SUM(Input!$T$287:$U$287,Input!$R$289:$S$289)","v":378},{"$f":"SUM(Input!$T$350:$U$350,Input!$R$352:$S$352)","v":244},{"$f":"SUM(Input!$T$413:$U$413,Input!$R$415:$S$415)","v":274},null,459,479,504,680,606,413,444,null,272,408,680]
[null,null,1045,1145,{"$f":"SUM(Input!$U$36,Input!$R$38:$T$38)","v":171},{"$f":"SUM(Input!$U$99,Input!$R$101:$T$101)","v":165},{"$f":"SUM(Input!$U$162,Input!$R$164:$T$164)","v":179},{"$f":"SUM(Input!$U$225,Input!$R$227:$T$227)","v":274},{"$f":"SUM(Input!$U$288,Input!$R$290:$T$290)","v":236},{"$f":"SUM(Input!$U$351,Input!$R$353:$T$353)","v":169},{"$f":"SUM(Input!$U$414,Input!$R$416:$T$416)","v":176},null,{"$f":"SUM(Input!$U$35,Input!$R$37:$T$37)","v":282},{"$f":"SUM(Input!$U$98,Input!$R$100:$T$100)","v":296},{"$f":"SUM(Input!$U$161,Input!$R$163:$T$163)","v":316},{"$f":"SUM(Input!$U$224,Input!$R$226:$T$226)","v":392},{"$f":"SUM(Input!$U$287,Input!$R$289:$T$289)","v":368},{"$f":"SUM(Input!$U$350,Input!$R$352:$T$352)","v":254},{"$f":"SUM(Input!$U$413,Input!$R$415:$T$415)","v":265},null,453,461,495,666,604,423,441,null,274,392,666]
[null,null,1100,1200,{"$f":"SUM(Input!$R$38:$U$38)","v":172},{"$f":"SUM(Input!$R$101:$U$101)","v":156},{"$f":"SUM(Input!$R$164:$U$164)","v":203},{"$f":"SUM(Input!$R$227:$U$227)","v":259},{"$f":"SUM(Input!$R$290:$U$290)","v":252},{"$f":"SUM(Input!$R$353:$U$353)","v":193},{"$f":"SUM(Input!$R$416:$U$416)","v":189},null,{"$f":"SUM(Input!$R$37:$U$37)","v":282},{"$f":"SUM(Input!$R$100:$U$100)","v":284},{"$f":"SUM(Input!$R$163:$U$163)","v":306},{"$f":"SUM(Input!$R$226:$U$226)","v":377},{"$f":"SUM(Input!$R$289:$U$289)","v":352},{"$f":"SUM(Input!$R$352:$U$352)","v":271},{"$f":"SUM(Input!$R$415:$U$415)","v":266},null,454,440,509,636,604,464,455,null,259,377,636]
[null,null,1115,1215,{"$f":"SUM(Input!$S$38:$U$38,Input!$R$40)","v":187},{"$f":"SUM(Input!$S$101:$U$101,Input!$R$103)","v":150},{"$f":"SUM(Input!$S$164:$U$164,Input!$R$166)","v":215},{"$f":"SUM(Input!$S$227:$U$227,Input!$R$229)","v":274},{"$f":"SUM(Input!$S$290:$U$290,Input!$R$292)","v":280},{"$f":"SUM(Input!$S$353:$U$353,Input!$R$355)","v":192},{"$f":"SUM(Input!$S$416:$U$416,Input!$R$418)","v":190},null,{"$f":"SUM(Input!$S$37:$U$37,Input!$R$39)","v":275},{"$f":"SUM(Input!$S$100:$U$100,Input!$R$102)","v":266},{"$f":"SUM(Input!$S$163:$U$163,Input!$R$165)","v":276},{"$f":"SUM(Input!$S$226:$U$226,Input!$R$228)","v":366},{"$f":"SUM(Input!$S$289:$U$289,Input!$R$291)","v":357},{"$f":"SUM(Input!$S$352:$U$352,Input!$R$354)","v":278},{"$f":"SUM(Input!$S$415:$U$415,Input!$R$417)","v":265},null,462,416,491,640,637,470,455,null,280,366,640]
[null,null,1130,1230,{"$f":"SUM(Input!$T$38:$U$38,Input!$R$40:$S$40)","v":202},{"$f":"SUM(Input!$T$101:$U$101,Input!$R$103:$S$103)","v":165},{"$f":"SUM(Input!$T$164:$U$164,Input!$R$166:$S$166)","v":236},{"$f":"SUM(Input!$T$227:$U$227,Input!$R$229:$S$229)","v":295},{"$f":"SUM(Input!$T$290:$U$290,Input!$R$292:$S$292)","v":292},{"$f":"SUM(Input!$T$353:$U$353,Input!$R$355:$S$355)","v":200},{"$f":"SUM(Input!$T$416:$U$416,Input!$R$418:$S$418)","v":194},null,{"$f":"SUM(Input!$T$37:$U$37,Input!$R$39:$S$39)","v":278},{"$f":"SUM(Input!$T$100:$U$100,Input!$R$102:$S$102)","v":239},{"$f":"SUM(Input!$T$163:$U$163,Input!$R$165:$S$165)","v":261},{"$f":"SUM(Input!$T$226:$U$226,Input!$R$228:$S$228)","v":361},{"$f":"SUM(Input!$T$289:$U$289,Input!$R$291:$S$291)","v":356},{"$f":"SUM(Input!$T$352:$U$352,Input!$R$354:$S$354)","v":269},{"$f":"SUM(Input!$T$415:$U$415,Input!$R$417:$S$417)","v":241},null,480,404,497,656,648,469,435,null,295,361,656]
[null,null,1145,1245,{"$f":"SUM(Input!$U$38,Input!$R$40:$T$40)","v":199},{"$f":"SUM(Input!$U$101,Input!$R$103:$T$103)","v":189},{"$f":"SUM(Input!$U$164,Input!$R$166:$T$166)","v":252},{"$f":"SUM(Input!$U$227,Input!$R$229:$T$229)","v":308},{"$f":"SUM(Input!$U$290,Input!$R$292:$T$292)","v":296},{"$f":"SUM(Input!$U$353,Input!$R$355:$T$355)","v":216},{"$f":"SUM(Input!$U$416,Input!$R$418:$T$418)","v":192},null,{"$f":"SUM(Input!$U$37,Input!$R$39:$T$39)","v":282},{"$f":"SUM(Input!$U$100,Input!$R$102:$T$102)","v":230},{"$f":"SUM(Input!$U$163,Input!$R$165:$T$165)","v":265},{"$f":"SUM(Input!$U$226,Input!$R$228:$T$228)","v":374},{"$f":"SUM(Input!$U$289,Input!$R$291:$T$291)","v":372},{"$f":"SUM(Input!$U$352,Input!$R$354:$T$354)","v":257},{"$f":"SUM(Input!$U$415,Input!$R$417:$T$417)","v":229},null,481,419,517,682,668,473,421,null,308,374,682]
[null,null,1200,1300,{"$f":"SUM(Input!$R$40:$U$40)","v":204},{"$f":"SUM(Input!$R$103:$U$103)","v":214},{"$f":"SUM(Input!$R$166:$U$166)","v":245},{"$f":"SUM(Input!$R$229:$U$229)","v":315},{"$f":"SUM(Input!$R$292:$U$292)","v":295},{"$f":"SUM(Input!$R$355:$U$355)","v":207},{"$f":"SUM(Input!$R$418:$U$418)","v":194},null,{"$f":"SUM(Input!$R$39:$U$39)","v":270},{"$f":"SUM(Input!$R$102:$U$102)","v":213},{"$f":"SUM(Input!$R$165:$U$165)","v":251},{"$f":"SUM(Input!$R$228:$U$228)","v":360},{"$f":"SUM(Input!$R$291:$U$291)","v":373},{"$f":"SUM(Input!$R$354:$U$354)","v":245},{"$f":"SUM(Input!$R$417:$U$417)","v":225},null,474,427,496,675,668,452,419,null,315,373,675]
[null,null,1215,1315,{"$f":"SUM(Input!$S$40:$U$40,Input!$R$42)","v":186},{"$f":"SUM(Input!$S$103:$U$103,Input!$R$105)","v":224},{"$f":"SUM(Input!$S$166:$U$166,Input!$R$168)","v":233},{"$f":"SUM(Input!$S$229:$U$229,Input!$R$231)","v":320},{"$f":"SUM(Input!$S$292:$U$292,Input!$R$294)","v":304},{"$f":"SUM(Input!$S$355:$U$355,Input!$R$357)","v":208},{"$f":"SUM(Input!$S$418:$U$418,Input!$R$420)","v":197},null,{"$f":"SUM(Input!$S$39:$U$39,Input!$R$41)","v":261},{"$f":"SUM(Input!$S$102:$U$102,Input!$R$104)","v":212},{"$f":"SUM(Input!$S$165:$U$165,Input!$R$167)","v":247},{"$f":"SUM(Input!$S$228:$U$228,Input!$R$230)","v":356},{"$f":"SUM(Input!$S$291:$U$291,Input!$R$293)","v":350},{"$f":"SUM(Input!$S$354:$U$354,Input!$R$356)","v":227},{"$f":"SUM(Input!$S$417:$U$417,Input!$R$419)","v":220},null,447,436,480,676,654,435,417,null,320,356,676]
[null,null,1230,1330,{"$f":"SUM(Input!$T$40:$U$40,Input!$R$42:$S$42)","v":180},{"$f":"SUM(Input!$T$103:$U$103,Input!$R$105:$S$105)","v":224},{"$f":"SUM(Input!$T$166:$U$166,Input!$R$168:$S$168)","v":208},{"$f":"SUM(Input!$T$229:$U$229,Input!$R$231:$S$231)","v":309},{"$f":"SUM(Input!$T$292:$U$292,Input!$R$294:$S$294)","v":325},{"$f":"SUM(Input!$T$355:$U$355,Input!$R$357:$S$357)","v":208},{"$f":"SUM(Input!$T$418:$U$418,Input!$R$420:$S$420)","v":207},null,{"$f":"SUM(Input!$T$39:$U$39,Input!$R$41:$S$41)","v":223},{"$f":"SUM(Input!$T$102:$U$102,Input!$R$104:$S$104)","v":222},{"$f":"SUM(Input!$T$165:$U$165,Input!$R$167:$S$167)","v":241},{"$f":"SUM(Input!$T$228:$U$228,Input!$R$230:$S$230)","v":321},{"$f":"SUM(Input!$T$291:$U$291,Input!$R$293:$S$293)","v":335},{"$f":"SUM(Input!$T$354:$U$354,Input!$R$356:$S$356)","v":224},{"$f":"SUM(Input!$T$417:$U$417,Input!$R$419:$S$419)","v":216},null,403,446,449,630,660,432,423,null,325,335,660]
[null,null,1245,1345,{"$f":"SUM(Input!$U$40,Input!$R$42:$T$42)","v":192},{"$f":"SUM(Input!$U$103,Input!$R$105:$T$105)","v":230},{"$f":"SUM(Input!$U$166,Input!$R$168:$T$168)","v":215},{"$f":"SUM(Input!$U$229,Input!$R$231:$T$231)","v":309},{"$f":"SUM(Input!$U$292,Input!$R$294:$T$294)","v":341},{"$f":"SUM(Input!$U$355,Input!$R$357:$T$357)","v":191},{"$f":"SUM(Input!$U$418,Input!$R$420:$T$420)","v":197},null,{"$f":"SUM(Input!$U$39,Input!$R$41:$T$41)","v":210},{"$f":"SUM(Input!$U$102,Input!$R$104:$T$104)","v":236},{"$f":"SUM(Input!$U$165,Input!$R$167:$T$167)","v":237},{"$f":"SUM(Input!$U$228,Input!$R$230:$T$230)","v":316},{"$f":"SUM(Input!$U$291,Input!$R$293:$T$293)","v":318},{"$f":"SUM(Input!$U$354,Input!$R$356:$T$356)","v":208},{"$f":"SUM(Input!$U$417,Input!$R$419:$T$419)","v":226},null,402,466,452,625,659,399,423,null,341,318,659]
[null,null,1300,1400,{"$f":"SUM(Input!$R$42:$U$42)","v":193},{"$f":"SUM(Input!$R$105:$U$105)","v":237},{"$f":"SUM(Input!$R$168:$U$168)","v":219},{"$f":"SUM(Input!$R$231:$U$231)","v":320},{"$f":"SUM(Input!$R$294:$U$294)","v":341},{"$f":"SUM(Input!$R$357:$U$357)","v":198},{"$f":"SUM(Input!$R$420:$U$420)","v":208},null,{"$f":"SUM(Input!$R$41:$U$41)","v":206},{"$f":"SUM(Input!$R$104:$U$104)","v":239},{"$f":"SUM(Input!$R$167:$U$167)","v":244},{"$f":"SUM(Input!$R$230:$U$230)","v":324},{"$f":"SUM(Input!$R$293:$U$293)","v":306},{"$f":"SUM(Input!$R$356:$U$356)","v":203},{"$f":"SUM(Input!$R$419:$U$419)","v":231},null,399,476,463,644,647,401,439,null,341,324,647]
[null,null,1315,1415,{"$f":"SUM(Input!$S$42:$U$42,Input!$R$44)","v":218},{"$f":"SUM(Input!$S$105:$U$105,Input!$R$107)","v":253},{"$f":"SUM(Input!$S$168:$U$168,Input!$R$170)","v":253},{"$f":"SUM(Input!$S$231:$U$231,Input!$R$233)","v":319},{"$f":"SUM(Input!$S$294:$U$294,Input!$R$296)","v":303},{"$f":"SUM(Input!$S$357:$U$357,Input!$R$359)","v":228},{"$f":"SUM(Input!$S$420:$U$420,Input!$R$422)","v":214},null,{"$f":"SUM(Input!$S$41:$U$41,Input!$R$43)","v":210},{"$f":"SUM(Input!$S$104:$U$104,Input!$R$106)","v":230},{"$f":"SUM(Input!$S$167:$U$167,Input!$R$169)","v":254},{"$f":"SUM(Input!$S$230:$U$230,Input!$R$232)","v":323},{"$f":"SUM(Input!$S$293:$U$293,Input!$R$295)","v":304},{"$f":"SUM(Input!$S$356:$U$356,Input!$R$358)","v":195},{"$f":"SUM(Input!$S$419:$U$419,Input!$R$421)","v":217},null,428,483,507,642,607,423,431,null,319,323,642]
[null,null,1330,1430,{"$f":"SUM(Input!$T$42:$U$42,Input!$R$44:$S$44)","v":239},{"$f":"SUM(Input!$T$105:$U$105,Input!$R$107:$S$107)","v":272},{"$f":"SUM(Input!$T$168:$U$168,Input!$R$170:$S$170)","v":315},{"$f":"SUM(Input!$T$231:$U$231,Input!$R$233:$S$233)","v":306},{"$f":"SUM(Input!$T$294:$U$294,Input!$R$296:$S$296)","v":282},{"$f":"SUM(Input!$T$357:$U$357,Input!$R$359:$S$359)","v":250},{"$f":"SUM(Input!$T$420:$U$420,Input!$R$422:$S$422)","v":214},null,{"$f":"SUM(Input!$T$41:$U$41,Input!$R$43:$S$43)","v":229},{"$f":"SUM(Input!$T$104:$U$104,Input!$R$106:$S$106)","v":228},{"$f":"SUM(Input!$T$167:$U$167,Input!$R$169:$S$169)","v":266},{"$f":"SUM(Input!$T$230:$U$230,Input!$R$232:$S$232)","v":325},{"$f":"SUM(Input!$T$293:$U$293,Input!$R$295:$S$295)","v":306},{"$f":"SUM(Input!$T$356:$U$356,Input!$R$358:$S$358)","v":206},{"$f":"SUM(Input!$T$419:$U$419,Input!$R$421:$S$421)","v":237},null,468,500,581,631,588,456,451,null,315,325,631]
[null,null,1345,1445,{"$f":"SUM(Input!$U$42,Input!$R$44:$T$44)","v":283},{"$f":"SUM(Input!$U$105,Input!$R$107:$T$107)","v":298},{"$f":"SUM(Input!$U$168,Input!$R$170:$T$170)","v":362},{"$f":"SUM(Input!$U$231,Input!$R$233:$T$233)","v":299},{"$f":"SUM(Input!$U$294,Input!$R$296:$T$296)","v":258},{"$f":"SUM(Input!$U$357,Input!$R$359:$T$359)","v":285},{"$f":"SUM(Input!$U$420,Input!$R$422:$T$422)","v":272},null,{"$f":"SUM(Input!$U$41,Input!$R$43:$T$43)","v":273},{"$f":"SUM(Input!$U$104,Input!$R$106:$T$106)","v":234},{"$f":"SUM(Input!$U$167,Input!$R$169:$T$169)","v":268},{"$f":"SUM(Input!$U$230,Input!$R$232:$T$232)","v":305},{"$f":"SUM(Input!$U$293,Input!$R$295:$T$295)","v":294},{"$f":"SUM(Input!$U$356,Input!$R$358:$T$358)","v":243},{"$f":"SUM(Input!$U$419,Input!$R$421:$T$421)","v":254},null,556,532,630,604,552,528,526,null,362,305,630]
[null,null,1400,1500,{"$f":"SUM(Input!$R$44:$U$44)","v":322},{"$f":"SUM(Input!$R$107:$U$107)","v":299},{"$f":"SUM(Input!$R$170:$U$170)","v":407},{"$f":"SUM(Input!$R$233:$U$233)","v":305},{"$f":"SUM(Input!$R$296:$U$296)","v":263},{"$f":"SUM(Input!$R$359:$U$359)","v":322},{"$f":"SUM(Input!$R$422:$U$422)","v":297},null,{"$f":"SUM(Input!$R$43:$U$43)","v":330},{"$f":"SUM(Input!$R$106:$U$106)","v":276},{"$f":"SUM(Input!$R$169:$U$169)","v":291},{"$f":"SUM(Input!$R$232:$U$232)","v":317},{"$f":"SUM(Input!$R$295:$U$295)","v":293},{"$f":"SUM(Input!$R$358:$U$358)","v":282},{"$f":"SUM(Input!$R$421:$U$421)","v":277},null,652,575,698,622,556,604,574,null,407,330,698]
[]
[null,"Evening",1415,1515,{"$f":"SUM(Input!$S$44:$U$44,Input!$R$46)","v":366},{"$f":"SUM(Input!$S$107:$U$107,Input!$R$109)","v":361},{"$f":"SUM(Input!$S$170:$U$170,Input!$R$172)","v":426},{"$f":"SUM(Input!$S$233:$U$233,Input!$R$235)","v":306},{"$f":"SUM(Input!$S$296:$U$296,Input!$R$298)","v":300},{"$f":"SUM(Input!$S$359:$U$359,Input!$R$361)","v":357},{"$f":"SUM(Input!$S$422:$U$422,Input!$R$424)","v":341},null,{"$f":"SUM(Input!$S$43:$U$43,Input!$R$45)","v":377},{"$f":"SUM(Input!$S$106:$U$106,Input!$R$108)","v":304},{"$f":"SUM(Input!$S$169:$U$169,Input!$R$171)","v":316},{"$f":"SUM(Input!$S$232:$U$232,Input!$R$234)","v":296},{"$f":"SUM(Input!$S$295:$U$295,Input!$R$297)","v":279},{"$f":"SUM(Input!$S$358:$U$358,Input!$R$360)","v":320},{"$f":"SUM(Input!$S$421:$U$421,Input!$R$423)","v":324},null,{"$f":"E42+M42","v":743},{"$f":"F42+N42","v":665},{"$f":"G42+O42","v":742},{"$f":"H42+P42","v":602},{"$f":"I42+Q42","v":579},{"$f":"J42+R42","v":677},{"$f":"K42+S42","v":665},null,{"$f":"MAX(E42:K42)","v":426},{"$f":"MAX(M42:S42)","v":377},{"$f":"MAX(U42:AA42)","v":743}]
[null,null,1430,1530,{"$f":"SUM(Input!$T$44:$U$44,Input!$R$46:$S$46)","v":435},{"$f":"SUM(Input!$T$107:$U$107,Input!$R$109:$S$109)","v":399},{"$f":"SUM(Input!$T$170:$U$170,Input!$R$172:$S$172)","v":459},{"$f":"SUM(Input!$T$233:$U$233,Input!$R$235:$S$235)","v":319},{"$f":"SUM(Input!$T$296:$U$296,Input!$R$298:$S$298)","v":295},{"$f":"SUM(Input!$T$359:$U$359,Input!$R$361:$S$361)","v":398},{"$f":"SUM(Input!$T$422:$U$422,Input!$R$424:$S$424)","v":400},null,{"$f":"SUM(Input!$T$43:$U$43,Input!$R$45:$S$45)","v":422},{"$f":"SUM(Input!$T$106:$U$106,Input!$R$108:$S$108)","v":348},{"$f":"SUM(Input!$T$169:$U$169,Input!$R$171:$S$171)","v":350},{"$f":"SUM(Input!$T$232:$U$232,Input!$R$234:$S$234)","v":300},{"$f":"SUM(Input!$T$295:$U$295,Input!$R$297:$S$297)","v":283},{"$f":"SUM(Input!$T$358:$U$358,Input!$R$360:$S$360)","v":371},{"$f":"SUM(Input!$T$421:$U$421,Input!$R$423:$S$423)","v":357},null,857,747,809,619,578,769,757,null,459,422,{"$f":"MAX(U43:AA43)","v":857}]
[null,null,1445,1545,{"$f":"SUM(Input!$U$44,Input!$R$46:$T$46)","v":454},{"$f":"SUM(Input!$U$107,Input!$R$109:$T$109)","v":425},{"$f":"SUM(Input!$U$170,Input!$R$172:$T$172)","v":496},{"$f":"SUM(Input!$U$233,Input!$R$235:$T$235)","v":343},{"$f":"SUM(Input!$U$296,Input!$R$298:$T$298)","v":321},{"$f":"SUM(Input!$U$359,Input!$R$361:$T$361)","v":473},{"$f":"SUM(Input!$U$422,Input!$R$424:$T$424)","v":426},null,{"$f":"SUM(Input!$U$43,Input!$R$45:$T$45)","v":454},{"$f":"SUM(Input!$U$106,Input!$R$108:$T$108)","v":377},{"$f":"SUM(Input!$U$169,Input!$R$171:$T$171)","v":381},{"$f":"SUM(Input!$U$232,Input!$R$234:$T$234)","v":316},{"$f":"SUM(Input!$U$295,Input!$R$297:$T$297)","v":293},{"$f":"SUM(Input!$U$358,Input!$R$360:$T$360)","v":389},{"$f":"SUM(Input!$U$421,Input!$R$423:$T$423)","v":386},null,908,802,877,659,614,862,812,null,496,454,908]
[null,null,1500,1600,{"$f":"SUM(Input!$R$46:$U$46)","v":488},{"$f":"SUM(Input!$R$109:$U$109)","v":508},{"$f":"SUM(Input!$R$172:$U$172)","v":524},{"$f":"SUM(Input!$R$235:$U$235)","v":328},{"$f":"SUM(Input!$R$298:$U$298)","v":308},{"$f":"SUM(Input!$R$361:$U$361)","v":546},{"$f":"SUM(Input!$R$424:$U$424)","v":478},null,{"$f":"SUM(Input!$R$45:$U$45)","v":430},{"$f":"SUM(Input!$R$108:$U$108)","v":375},{"$f":"SUM(Input!$R$171:$U$171)","v":403},{"$f":"SUM(Input!$R$234:$U$234)","v":286},{"$f":"SUM(Input!$R$297:$U$297)","v":286},{"$f":"SUM(Input!$R$360:$U$360)","v":374},{"$f":"SUM(Input!$R$423:$U$423)","v":386},null,918,883,927,614,594,920,864,null,546,430,927]
[null,null,1515,1615,{"$f":"SUM(Input!$S$46:$U$46,Input!$R$48)","v":497},{"$f":"SUM(Input!$S$109:$U$109,Input!$R$111)","v":548},{"$f":"SUM(Input!$S$172:$U$172,Input!$R$174)","v":570},{"$f":"SUM(Input!$S$235:$U$235,Input!$R$237)","v":333},{"$f":"SUM(Input!$S$298:$U$298,Input!$R$300)","v":296},{"$f":"SUM(Input!$S$361:$U$361,Input!$R$363)","v":598},{"$f":"SUM(Input!$S$424:$U$424,Input!$R$426)","v":518},null,{"$f":"SUM(Input!$S$45:$U$45,Input!$R$47)","v":416},{"$f":"SUM(Input!$S$108:$U$108,Input!$R$110)","v":387},{"$f":"SUM(Input!$S$171:$U$171,Input!$R$173)","v":389},{"$f":"SUM(Input!$S$234:$U$234,Input!$R$236)","v":309},{"$f":"SUM(Input!$S$297:$U$297,Input!$R$299)","v":283},{"$f":"SUM(Input!$S$360:$U$360,Input!$R$362)","v":379},{"$f":"SUM(Input!$S$423:$U$423,Input!$R$425)","v":378},null,913,935,959,642,579,977,896,null,598,416,977]
[null,null,1530,1630,{"$f":"SUM(Input!$T$46:$U$46,Input!$R$48:$S$48)","v":510},{"$f":"SUM(Input!$T$109:$U$109,Input!$R$111:$S$111)","v":615},{"$f":"SUM(Input!$T$172:$U$172,Input!$R$174:$S$174)","v":601},{"$f":"SUM(Input!$T$235:$U$235,Input!$R$237:$S$237)","v":329},{"$f":"SUM(Input!$T$298:$U$298,Input!$R$300:$S$300)","v":298},{"$f":"SUM(Input!$T$361:$U$361,Input!$R$363:$S$363)","v":628},{"$f":"SUM(Input!$T$424:$U$424,Input!$R$426:$S$426)","v":543},null,{"$f":"SUM(Input!$T$45:$U$45,Input!$R$47:$S$47)","v":390},{"$f":"SUM(Input!$T$108:$U$108,Input!$R$110:$S$110)","v":393},{"$f":"SUM(Input!$T$171:$U$171,Input!$R$173:$S$173)","v":380},{"$f":"SUM(Input!$T$234:$U$234,Input!$R$236:$S$236)","v":308},{"$f":"SUM(Input!$T$297:$U$297,Input!$R$299:$S$299)","v":262},{"$f":"SUM(Input!$T$360:$U$360,Input!$R$362:$S$362)","v":337},{"$f":"SUM(Input!$T$423:$U$423,Input!$R$425:$S$425)","v":350},null,900,1008,981,637,560,965,893,null,628,393,1008]
[null,null,1545,1645,{"$f":"SUM(Input!$U$46,Input!$R$48:$T$48)","v":535},{"$f":"SUM(Input!$U$109,Input!$R$111:$T$111)","v":700},{"$f":"SUM(Input!$U$172,Input!$R$174:$T$174)","v":643},{"$f":"SUM(Input!$U$235,Input!$R$237:$T$237)","v":307},{"$f":"SUM(Input!$U$298,Input!$R$300:$T$300)","v":265},{"$f":"SUM(Input!$U$361,Input!$R$363:$T$363)","v":635},{"$f":"SUM(Input!$U$424,Input!$R$426:$T$426)","v":586},null,{"$f":"SUM(Input!$U$45,Input!$R$47:$T$47)","v":356},{"$f":"SUM(Input!$U$108,Input!$R$110:$T$110)","v":372},{"$f":"SUM(Input!$U$171,Input!$R$173:$T$173)","v":359},{"$f":"SUM(Input!$U$234,Input!$R$236:$T$236)","v":299},{"$f":"SUM(Input!$U$297,Input!$R$299:$T$299)","v":249},{"$f":"SUM(Input!$U$360,Input!$R$362:$T$362)","v":315},{"$f":"SUM(Input!$U$423,Input!$R$425:$T$425)","v":324},null,891,1072,1002,606,514,950,910,null,700,372,1072]
[null,null,1600,1700,{"$f":"SUM(Input!$R$48:$U$48)","v":586},{"$f":"SUM(Input!$R$111:$U$111)","v":758},{"$f":"SUM(Input!$R$174:$U$174)","v":692},{"$f":"SUM(Input!$R$237:$U$237)","v":307},{"$f":"SUM(Input!$R$300:$U$300)","v":254},{"$f":"SUM(Input!$R$363:$U$363)","v":651},{"$f":"SUM(Input!$R$426:$U$426)","v":622},null,{"$f":"SUM(Input!$R$47:$U$47)","v":356},{"$f":"SUM(Input!$R$110:$U$110)","v":370},{"$f":"SUM(Input!$R$173:$U$173)","v":373},{"$f":"SUM(Input!$R$236:$U$236)","v":320},{"$f":"SUM(Input!$R$299:$U$299)","v":239},{"$f":"SUM(Input!$R$362:$U$362)","v":307},{"$f":"SUM(Input!$R$425:$U$425)","v":315},null,942,1128,1065,627,493,958,937,null,758,373,1128]
[null,null,1615,1715,{"$f":"SUM(Input!$S$48:$U$48,Input!$R$50)","v":612},{"$f":"SUM(Input!$S$111:$U$111,Input!$R$113)","v":816},{"$f":"SUM(Input!$S$174:$U$174,Input!$R$176)","v":713},{"$f":"SUM(Input!$S$237:$U$237,Input!$R$239)","v":277},{"$f":"SUM(Input!$S$300:$U$300,Input!$R$302)","v":247},{"$f":"SUM(Input!$S$363:$U$363,Input!$R$365)","v":663},{"$f":"SUM(Input!$S$426:$U$426,Input!$R$428)","v":663},null,{"$f":"SUM(Input!$S$47:$U$47,Input!$R$49)","v":367},{"$f":"SUM(Input!$S$110:$U$110,Input!$R$112)","v":361},{"$f":"SUM(Input!$S$173:$U$173,Input!$R$175)","v":376},{"$f":"SUM(Input!$S$236:$U$236,Input!$R$238)","v":294},{"$f":"SUM(Input!$S$299:$U$299,Input!$R$301)","v":225},{"$f":"SUM(Input!$S$362:$U$362,Input!$R$364)","v":347},{"$f":"SUM(Input!$S$425:$U$425,Input!$R$427)","v":309},null,979,1177,1089,571,472,1010,972,null,816,376,1177]
[null,null,1630,1730,{"$f":"SUM(Input!$T$48:$U$48,Input!$R$50:$S$50)","v":651},{"$f":"SUM(Input!$T$111:$U$111,Input!$R$113:$S$113)","v":864},{"$f":"SUM(Input!$T$174:$U$174,Input!$R$176:$S$176)","v":677},{"$f":"SUM(Input!$T$237:$U$237,Input!$R$239:$S$239)","v":254},{"$f":"SUM(Input!$T$300:$U$300,Input!$R$302:$S$302)","v":235},{"$f":"SUM(Input!$T$363:$U$363,Input!$R$365:$S$365)","v":697},{"$f":"SUM(Input!$T$426:$U$426,Input!$R$428:$S$428)","v":707},null,{"$f":"SUM(Input!$T$47:$U$47,Input!$R$49:$S$49)","v":371},{"$f":"SUM(Input!$T$110:$U$110,Input!$R$112:$S$112)","v":352},{"$f":"SUM(Input!$T$173:$U$173,Input!$R$175:$S$175)","v":375},{"$f":"SUM(Input!$T$236:$U$236,Input!$R$238:$S$238)","v":272},{"$f":"SUM(Input!$T$299:$U$299,Input!$R$301:$S$301)","v":228},{"$f":"SUM(Input!$T$362:$U$362,Input!$R$364:$S$364)","v":408},{"$f":"SUM(Input!$T$425:$U$425,Input!$R$427:$S$427)","v":334},null,1022,1216,1052,526,463,1105,1041,null,864,408,1216]
[null,null,1645,1745,{"$f":"SUM(Input!$U$48,Input!$R$50:$T$50)","v":653},{"$f":"SUM(Input!$U$111,Input!$R$113:$T$113)","v":878},{"$f":"SUM(Input!$U$174,Input!$R$176:$T$176)","v":618},{"$f":"SUM(Input!$U$237,Input!$R$239:$T$239)","v":251},{"$f":"SUM(Input!$U$300,Input!$R$302:$T$302)","v":247},{"$f":"SUM(Input!$U$363,Input!$R$365:$T$365)","v":722},{"$f":"SUM(Input!$U$426,Input!$R$428:$T$428)","v":712},null,{"$f":"SUM(Input!$U$47,Input!$R$49:$T$49)","v":348},{"$f":"SUM(Input!$U$110,Input!$R$112:$T$112)","v":366},{"$f":"SUM(Input!$U$173,Input!$R$175:$T$175)","v":357},{"$f":"SUM(Input!$U$236,Input!$R$238:$T$238)","v":252},{"$f":"SUM(Input!$U$299,Input!$R$301:$T$301)","v":217},{"$f":"SUM(Input!$U$362,Input!$R$364:$T$364)","v":406},{"$f":"SUM(Input!$U$425,Input!$R$427:$T$427)","v":337},null,1001,1244,975,503,464,1128,1049,null,878,406,1244]
[null,null,1700,1800,{"$f":"SUM(Input!$R$50:$U$50)","v":636},{"$f":"SUM(Input!$R$113:$U$113)","v":863},{"$f":"SUM(Input!$R$176:$U$176)","v":573},{"$f":"SUM(Input!$R$239:$U$239)","v":229},{"$f":"SUM(Input!$R$302:$U$302)","v":240},{"$f":"SUM(Input!$R$365:$U$365)","v":677},{"$f":"SUM(Input!$R$428:$U$428)","v":721},null,{"$f":"SUM(Input!$R$49:$U$49)","v":336},{"$f":"SUM(Input!$R$112:$U$112)","v":372},{"$f":"SUM(Input!$R$175:$U$175)","v":332},{"$f":"SUM(Input!$R$238:$U$238)","v":222},{"$f":"SUM(Input!$R$301:$U$301)","v":212},{"$f":"SUM(Input!$R$364:$U$364)","v":392},{"$f":"SUM(Input!$R$427:$U$427)","v":326},null,972,1235,905,451,452,1069,1047,null,863,392,1235]
[null,null,1715,1815,{"$f":"SUM(Input!$S$50:$U$50,Input!$R$52)","v":656},{"$f":"SUM(Input!$S$113:$U$113,Input!$R$115)","v":741},{"$f":"SUM(Input!$S$176:$U$176,Input!$R$178)","v":503},{"$f":"SUM(Input!$S$239:$U$239,Input!$R$241)","v":212},{"$f":"SUM(Input!$S$302:$U$302,Input!$R$304)","v":223},{"$f":"SUM(Input!$S$365:$U$365,Input!$R$367)","v":651},{"$f":"SUM(Input!$S$428:$U$428,Input!$R$430)","v":697},null,{"$f":"SUM(Input!$S$49:$U$49,Input!$R$51)","v":317},{"$f":"SUM(Input!$S$112:$U$112,Input!$R$114)","v":371},{"$f":"SUM(Input!$S$175:$U$175,Input!$R$177)","v":327},{"$f":"SUM(Input!$S$238:$U$238,Input!$R$240)","v":229},{"$f":"SUM(Input!$S$301:$U$301,Input!$R$303)","v":216},{"$f":"SUM(Input!$S$364:$U$364,Input!$R$366)","v":387},{"$f":"SUM(Input!$S$427:$U$427,Input!$R$429)","v":333},null,973,1112,830,441,439,1038,1030,null,741,387,1112]
[null,null,1730,1830,{"$f":"SUM(Input!$T$50:$U$50,Input!$R$52:$S$52)","v":604},{"$f":"SUM(Input!$T$113:$U$113,Input!$R$115:$S$115)","v":623},{"$f":"SUM(Input!$T$176:$U$176,Input!$R$178:$S$178)","v":473},{"$f":"SUM(Input!$T$239:$U$239,Input!$R$241:$S$241)","v":209},{"$f":"SUM(Input!$T$302:$U$302,Input!$R$304:$S$304)","v":214},{"$f":"SUM(Input!$T$365:$U$365,Input!$R$367:$S$367)","v":604},{"$f":"SUM(Input!$T$428:$U$428,Input!$R$430:$S$430)","v":636},null,{"$f":"SUM(Input!$T$49:$U$49,Input!$R$51:$S$51)","v":315},{"$f":"SUM(Input!$T$112:$U$112,Input!$R$114:$S$114)","v":343},{"$f":"SUM(Input!$T$175:$U$175,Input!$R$177:$S$177)","v":317},{"$f":"SUM(Input!$T$238:$U$238,Input!$R$240:$S$240)","v":230},{"$f":"SUM(Input!$T$301:$U$301,Input!$R$303:$S$303)","v":189},{"$f":"SUM(Input!$T$364:$U$364,Input!$R$366:$S$366)","v":338},{"$f":"SUM(Input!$T$427:$U$427,Input!$R$429:$S$429)","v":321},null,919,966,790,439,403,942,957,null,636,343,966]
[null,null,1745,1845,{"$f":"SUM(Input!$U$50,Input!$R$52:$T$52)","v":558},{"$f":"SUM(Input!$U$113,Input!$R$115:$T$115)","v":502},{"$f":"SUM(Input!$U$176,Input!$R$178:$T$178)","v":426},{"$f":"SUM(Input!$U$239,Input!$R$241:$T$241)","v":187},{"$f":"SUM(Input!$U$302,Input!$R$304:$T$304)","v":187},{"$f":"SUM(Input!$U$365,Input!$R$367:$T$367)","v":508},{"$f":"SUM(Input!$U$428,Input!$R$430:$T$430)","v":557},null,{"$f":"SUM(Input!$U$49,Input!$R$51:$T$51)","v":314},{"$f":"SUM(Input!$U$112,Input!$R$114:$T$114)","v":335},{"$f":"SUM(Input!$U$175,Input!$R$177:$T$177)","v":329},{"$f":"SUM(Input!$U$238,Input!$R$240:$T$240)","v":223},{"$f":"SUM(Input!$U$301,Input!$R$303:$T$303)","v":173},{"$f":"SUM(Input!$U$364,Input!$R$366:$T$366)","v":323},{"$f":"SUM(Input!$U$427,Input!$R$429:$T$429)","v":312},null,872,837,755,410,360,831,869,null,558,335,872]
[null,null,1800,1900,{"$f":"SUM(Input!$R$52:$U$52)","v":479},{"$f":"SUM(Input!$R$115:$U$115)","v":382},{"$f":"SUM(Input!$R$178:$U$178)","v":355},{"$f":"SUM(Input!$R$241:$U$241)","v":172},{"$f":"SUM(Input!$R$304:$U$304)","v":171},{"$f":"SUM(Input!$R$367:$U$367)","v":436},{"$f":"SUM(Input!$R$430:$U$430)","v":458},null,{"$f":"SUM(Input!$R$51:$U$51)","v":298},{"$f":"SUM(Input!$R$114:$U$114)","v":312},{"$f":"SUM(Input!$R$177:$U$177)","v":292},{"$f":"SUM(Input!$R$240:$U$240)","v":200},{"$f":"SUM(Input!$R$303:$U$303)","v":153},{"$f":"SUM(Input!$R$366:$U$366)","v":327},{"$f":"SUM(Input!$R$429:$U$429)","v":292},null,777,694,647,372,324,763,750,null,479,327,777]
[null,null,1815,1915,{"$f":"SUM(Input!$S$52:$U$52,Input!$R$54)","v":402},{"$f":"SUM(Input!$S$115:$U$115,Input!$R$117)","v":335},{"$f":"SUM(Input!$S$178:$U$178,Input!$R$180)","v":317},{"$f":"SUM(Input!$S$241:$U$241,Input!$R$243)","v":153},{"$f":"SUM(Input!$S$304:$U$304,Input!$R$306)","v":155},{"$f":"SUM(Input!$S$367:$U$367,Input!$R$369)","v":340},{"$f":"SUM(Input!$S$430:$U$430,Input!$R$432)","v":372},null,{"$f":"SUM(Input!$S$51:$U$51,Input!$R$53)","v":255},{"$f":"SUM(Input!$S$114:$U$114,Input!$R$116)","v":317},{"$f":"SUM(Input!$S$177:$U$177,Input!$R$179)","v":271},{"$f":"SUM(Input!$S$240:$U$240,Input!$R$242)","v":164},{"$f":"SUM(Input!$S$303:$U$303,Input!$R$305)","v":130},{"$f":"SUM(Input!$S$366:$U$366,Input!$R$368)","v":298},{"$f":"SUM(Input!$S$429:$U$429,Input!$R$431)","v":258},null,657,652,588,317,285,638,630,null,402,317,657]
[null,null,1830,1930,{"$f":"SUM(Input!$T$52:$U$52,Input!$R$54:$S$54)","v":324},{"$f":"SUM(Input!$T$115:$U$115,Input!$R$117:$S$117)","v":281},{"$f":"SUM(Input!$T$178:$U$178,Input!$R$180:$S$180)","v":269},{"$f":"SUM(Input!$T$241:$U$241,Input!$R$243:$S$243)","v":140},{"$f":"SUM(Input!$T$304:$U$304,Input!$R$306:$S$306)","v":141},{"$f":"SUM(Input!$T$367:$U$367,Input!$R$369:$S$369)","v":256},{"$f":"SUM(Input!$T$430:$U$430,Input!$R$432:$S$432)","v":302},null,{"$f":"SUM(Input!$T$51:$U$51,Input!$R$53:$S$53)","v":226},{"$f":"SUM(Input!$T$114:$U$114,Input!$R$116:$S$116)","v":284},{"$f":"SUM(Input!$T$177:$U$177,Input!$R$179:$S$179)","v":239},{"$f":"SUM(Input!$T$240:$U$240,Input!$R$242:$S$242)","v":130},{"$f":"SUM(Input!$T$303:$U$303,Input!$R$305:$S$305)","v":121},{"$f":"SUM(Input!$T$366:$U$366,Input!$R$368:$S$368)","v":264},{"$f":"SUM(Input!$T$429:$U$429,Input!$R$431:$S$431)","v":232},null,550,565,508,270,262,520,534,null,324,284,565]
[null,null,1845,1945,{"$f":"SUM(Input!$U$52,Input!$R$54:$T$54)","v":268},{"$f":"SUM(Input!$U$115,Input!$R$117:$T$117)","v":244},{"$f":"SUM(Input!$U$178,Input!$R$180:$T$180)","v":219},{"$f":"SUM(Input!$U$241,Input!$R$243:$T$243)","v":125},{"$f":"SUM(Input!$U$304,Input!$R$306:$T$306)","v":132},{"$f":"SUM(Input!$U$367,Input!$R$369:$T$369)","v":208},{"$f":"SUM(Input!$U$430,Input!$R$432:$T$432)","v":248},null,{"$f":"SUM(Input!$U$51,Input!$R$53:$T$53)","v":202},{"$f":"SUM(Input!$U$114,Input!$R$116:$T$116)","v":247},{"$f":"SUM(Input!$U$177,Input!$R$179:$T$179)","v":189},{"$f":"SUM(Input!$U$240,Input!$R$242:$T$242)","v":107},{"$f":"SUM(Input!$U$303,Input!$R$305:$T$305)","v":117},{"$f":"SUM(Input!$U$366,Input!$R$368:$T$368)","v":238},{"$f":"SUM(Input!$U$429,Input!$R$431:$T$431)","v":192},null,470,491,408,232,249,446,440,null,268,247,491]

{"sheet":"Peaks2","index":5,"n_rows":60,"n_cols":40,"rows_kept":60,"cut":false,"hidden":true,"merged":[[1,36,1,39],[1,28,1,34],[41,1,59,1],[1,4,1,10],[1,12,1,18],[1,20,1,26],[3,1,18,1],[20,1,39,1]]}
[]
[null,null,null,null,"Direction 2 / Lane1",null,null,null,null,null,null,null,"Direction 2 / Lane2",null,null,null,null,null,null,null,"Direction 2 / Both Lanes",null,null,null,null,null,null,null,"All Lanes",null,null,null,null,null,null,null,"Daily Maximums"]
[null,null,null,null,{"$f":"LEFT(Input2!$A$10,3)","v":""},{"$f":"LEFT(Input2!$A$73,3)","v":""},{"$f":"LEFT(Input2!$A$136,3)","v":""},{"$f":"LEFT(Input2!$A$199,3)","v":""},{"$f":"LEFT(Input2!$A$262,3)","v":""},{"$f":"LEFT(Input2!$A$325,3)","v":""},{"$f":"LEFT(Input2!$A$388,3)","v":""},null,{"$f":"LEFT(Input2!$A$10,3)","v":""},{"$f":"LEFT(Input2!$A$73,3)","v":""},{"$f":"LEFT(Input2!$A$136,3)","v":""},{"$f":"LEFT(Input2!$A$199,3)","v":""},{"$f":"LEFT(Input2!$A$262,3)","v":""},{"$f":"LEFT(Input2!$A$325,3)","v":""},{"$f":"LEFT(Input2!$A$388,3)","v":""},null,{"$f":"LEFT(Input2!$A$10,3)","v":""},{"$f":"LEFT(Input2!$A$73,3)","v":""},{"$f":"LEFT(Input2!$A$136,3)","v":""},{"$f":"LEFT(Input2!$A$199,3)","v":""},{"$f":"LEFT(Input2!$A$262,3)","v":""},{"$f":"LEFT(Input2!$A$325,3)","v":""},{"$f":"LEFT(Input2!$A$388,3)","v":""},null,{"$f":"LEFT(Input2!$A$10,3)","v":""},{"$f":"LEFT(Input2!$A$73,3)","v":""},{"$f":"LEFT(Input2!$A$136,3)","v":""},{"$f":"LEFT(Input2!$A$199,3)","v":""},{"$f":"LEFT(Input2!$A$262,3)","v":""},{"$f":"LEFT(Input2!$A$325,3)","v":""},{"$f":"LEFT(Input2!$A$388,3)","v":""},null,"Dir2/Lane1","Dir2/Lane2","Dir2/Both","All Lanes"]
[null,"Morning","0515","0615",null,null,null,null,null,null,null,null,null,null,null,null,null,null,null,null,null,null,null,null,null,null,null,null,null,null,null,null,null,null,null,null,{"$f":"MAX(E4:K4)","v":0},{"$f":"MAX(M4:S4)","v":0},{"$f":"MAX(U4:AA4)","v":0},{"$f":"MAX(AC4:AI4)","v":0}]
[null,null,"0530","0630",null,null,null,null,null,null,null,null,null,null,null,null,null,null,null,null,null,null,null,null,null,null,null,null,null,null,null,null,null,null,null,null,0,0,0,0]
[null,null,"0545","0645",null,null,null,null,null,null,null,null,null,null,null,null,null,null,null,null,null,null,null,null,null,null,null,null,null,null,null,null,null,null,null,null,0,0,0,0]
[null,null,"0600","0700",null,null,null,null,null,null,null,null,null,null,null,null,null,null,null,null,null,null,null,null,null,null,null,null,null,null,null,null,null,null,null,null,0,0,0,0]
[null,null,"0615","0715",null,null,null,null,null,null,null,null,null,null,null,null,null,null,null,null,null,null,null,null,null,null,null,null,null,null,null,null,null,null,null,null,0,0,0,0]
[null,null,"0630","0730",null,null,null,null,null,null,null,null,null,null,null,null,null,null,null,null,null,null,null,null,null,null,null,null,null,null,null,null,null,null,null,null,0,0,0,0]
[null,null,"0645","0745",null,null,null,null,null,null,null,null,null,null,null,null,null,null,null,null,null,null,null,null,null,null,null,null,null,null,null,null,null,null,null,null,0,0,0,0]
[null,null,"0700","0800",null,null,null,null,null,null,null,null,null,null,null,null,null,null,null,null,null,null,null,null,null,null,null,null,null,null,null,null,null,null,null,null,0,0,0,0]
[null,null,"0715","0815",null,null,null,null,null,null,null,null,null,null,null,null,null,null,null,null,null,null,null,null,null,null,null,null,null,null,null,null,null,null,null,null,0,0,0,0]
[null,null,"0730","0830",null,null,null,null,null,null,null,null,null,null,null,null,null,null,null,null,null,null,null,null,null,null,null,null,null,null,null,null,null,null,null,null,0,0,0,0]
[null,null,"0745","0845",null,null,null,null,null,null,null,null,null,null,null,null,null,null,null,null,null,null,null,null,null,null,null,null,null,null,null,null,null,null,null,null,0,0,0,0]
[null,null,"0800","0900",null,null,null,null,null,null,null,null,null,null,null,null,null,null,null,null,null,null,null,null,null,null,null,null,null,null,null,null,null,null,null,null,0,0,0,0]
[null,null,"0815","0915",null,null,null,null,null,null,null,null,null,null,null,null,null,null,null,null,null,null,null,null,null,null,null,null,null,null,null,null,null,null,null,null,0,0,0,0]
[null,null,"0830","0930",null,null,null,null,null,null,null,null,null,null,null,null,null,null,null,null,null,null,null,null,null,null,null,null,null,null,null,null,null,null,null,null,0,0,0,0]
[null,null,"0845","0945",null,null,null,null,null,null,null,null,null,null,null,null,null,null,null,null,null,null,null,null,null,null,null,null,null,null,null,null,null,null,null,null,0,0,0,0]
[null,null,"0900",1000,null,null,null,null,null,null,null,null,null,null,null,null,null,null,null,null,null,null,null,null,null,null,null,null,null,null,null,null,null,null,null,null,0,0,0,0]
[]
[null,"Middle Day","0915",1015,null,null,null,null,null,null,null,null,null,null,null,null,null,null,null,null,null,null,null,null,null,null,null,null,null,null,null,null,null,null,null,null,{"$f":"MAX(E21:K21)","v":0},{"$f":"MAX(M21:S21)","v":0},{"$f":"MAX(U21:AA21)","v":0},{"$f":"MAX(AC21:AI21)","v":0}]
[null,null,"0930",1030,null,null,null,null,null,null,null,null,null,null,null,null,null,null,null,null,null,null,null,null,null,null,null,null,null,null,null,null,null,null,null,null,0,0,0,0]
[null,null,"0945",1045,null,null,null,null,null,null,null,null,null,null,null,null,null,null,null,null,null,null,null,null,null,null,null,null,null,null,null,null,null,null,null,null,0,0,0,0]
[null,null,1000,1100,null,null,null,null,null,null,null,null,null,null,null,null,null,null,null,null,null,null,null,null,null,null,null,null,null,null,null,null,null,null,null,null,0,0,0,0]
[null,null,1015,1115,null,null,null,null,null,null,null,null,null,null,null,null,null,null,null,null,null,null,null,null,null,null,null,null,null,null,null,null,null,null,null,null,0,0,0,0]
[null,null,1030,1130,null,null,null,null,null,null,null,null,null,null,null,null,null,null,null,null,null,null,null,null,null,null,null,null,null,null,null,null,null,null,null,null,0,0,0,0]
[null,null,1045,1145,null,null,null,null,null,null,null,null,null,null,null,null,null,null,null,null,null,null,null,null,null,null,null,null,null,null,null,null,null,null,null,null,0,0,0,0]
[null,null,1100,1200,null,null,null,null,null,null,null,null,null,null,null,null,null,null,null,null,null,null,null,null,null,null,null,null,null,null,null,null,null,null,null,null,0,0,0,0]
[null,null,1115,1215,null,null,null,null,null,null,null,null,null,null,null,null,null,null,null,null,null,null,null,null,null,null,null,null,null,null,null,null,null,null,null,null,0,0,0,0]
[null,null,1130,1230,null,null,null,null,null,null,null,null,null,null,null,null,null,null,null,null,null,null,null,null,null,null,null,null,null,null,null,null,null,null,null,null,0,0,0,0]
[null,null,1145,1245,null,null,null,null,null,null,null,null,null,null,null,null,null,null,null,null,null,null,null,null,null,null,null,null,null,null,null,null,null,null,null,null,0,0,0,0]
[null,null,1200,1300,null,null,null,null,null,null,null,null,null,null,null,null,null,null,null,null,null,null,null,null,null,null,null,null,null,null,null,null,null,null,null,null,0,0,0,0]
[null,null,1215,1315,null,null,null,null,null,null,null,null,null,null,null,null,null,null,null,null,null,null,null,null,null,null,null,null,null,null,null,null,null,null,null,null,0,0,0,0]
[null,null,1230,1330,null,null,null,null,null,null,null,null,null,null,null,null,null,null,null,null,null,null,null,null,null,null,null,null,null,null,null,null,null,null,null,null,0,0,0,0]
[null,null,1245,1345,null,null,null,null,null,null,null,null,null,null,null,null,null,null,null,null,null,null,null,null,null,null,null,null,null,null,null,null,null,null,null,null,0,0,0,0]
[null,null,1300,1400,null,null,null,null,null,null,null,null,null,null,null,null,null,null,null,null,null,null,null,null,null,null,null,null,null,null,null,null,null,null,null,null,0,0,0,0]
[null,null,1315,1415,null,null,null,null,null,null,null,null,null,null,null,null,null,null,null,null,null,null,null,null,null,null,null,null,null,null,null,null,null,null,null,null,0,0,0,0]
[null,null,1330,1430,null,null,null,null,null,null,null,null,null,null,null,null,null,null,null,null,null,null,null,null,null,null,null,null,null,null,null,null,null,null,null,null,0,0,0,0]
[null,null,1345,1445,null,null,null,null,null,null,null,null,null,null,null,null,null,null,null,null,null,null,null,null,null,null,null,null,null,null,null,null,null,null,null,null,0,0,0,0]
[null,null,1400,1500,null,null,null,null,null,null,null,null,null,null,null,null,null,null,null,null,null,null,null,null,null,null,null,null,null,null,null,null,null,null,null,null,0,0,0,0]
[]
[null,"Evening",1415,1515,null,null,null,null,null,null,null,null,null,null,null,null,null,null,null,null,null,null,null,null,null,null,null,null,null,null,null,null,null,null,null,null,{"$f":"MAX(E42:K42)","v":0},{"$f":"MAX(M42:S42)","v":0},{"$f":"MAX(U42:AA42)","v":0},{"$f":"MAX(AC42:AI42)","v":0}]
[null,null,1430,1530,null,null,null,null,null,null,null,null,null,null,null,null,null,null,null,null,null,null,null,null,null,null,null,null,null,null,null,null,null,null,null,null,0,0,0,0]
[null,null,1445,1545,null,null,null,null,null,null,null,null,null,null,null,null,null,null,null,null,null,null,null,null,null,null,null,null,null,null,null,null,null,null,null,null,0,0,0,0]
[null,null,1500,1600,null,null,null,null,null,null,null,null,null,null,null,null,null,null,null,null,null,null,null,null,null,null,null,null,null,null,null,null,null,null,null,null,0,0,0,0]
[null,null,1515,1615,null,null,null,null,null,null,null,null,null,null,null,null,null,null,null,null,null,null,null,null,null,null,null,null,null,null,null,null,null,null,null,null,0,0,0,0]
[null,null,1530,1630,null,null,null,null,null,null,null,null,null,null,null,null,null,null,null,null,null,null,null,null,null,null,null,null,null,null,null,null,null,null,null,null,0,0,0,0]
[null,null,1545,1645,null,null,null,null,null,null,null,null,null,null,null,null,null,null,null,null,null,null,null,null,null,null,null,null,null,null,null,null,null,null,null,null,0,0,0,0]
[null,null,1600,1700,null,null,null,null,null,null,null,null,null,null,null,null,null,null,null,null,null,null,null,null,null,null,null,null,null,null,null,null,null,null,null,null,0,0,0,0]
[null,null,1615,1715,null,null,null,null,null,null,null,null,null,null,null,null,null,null,null,null,null,null,null,null,null,null,null,null,null,null,null,null,null,null,null,null,0,0,0,0]
[null,null,1630,1730,null,null,null,null,null,null,null,null,null,null,null,null,null,null,null,null,null,null,null,null,null,null,null,null,null,null,null,null,null,null,null,null,0,0,0,0]
[null,null,1645,1745,null,null,null,null,null,null,null,null,null,null,null,null,null,null,null,null,null,null,null,null,null,null,null,null,null,null,null,null,null,null,null,null,0,0,0,0]
[null,null,1700,1800,null,null,null,null,null,null,null,null,null,null,null,null,null,null,null,null,null,null,null,null,null,null,null,null,null,null,null,null,null,null,null,null,0,0,0,0]
[null,null,1715,1815,null,null,null,null,null,null,null,null,null,null,null,null,null,null,null,null,null,null,null,null,null,null,null,null,null,null,null,null,null,null,null,null,0,0,0,0]
[null,null,1730,1830,null,null,null,null,null,null,null,null,null,null,null,null,null,null,null,null,null,null,null,null,null,null,null,null,null,null,null,null,null,null,null,null,0,0,0,0]
[null,null,1745,1845,null,null,null,null,null,null,null,null,null,null,null,null,null,null,null,null,null,null,null,null,null,null,null,null,null,null,null,null,null,null,null,null,0,0,0,0]
[null,null,1800,1900,null,null,null,null,null,null,null,null,null,null,null,null,null,null,null,null,null,null,null,null,null,null,null,null,null,null,null,null,null,null,null,null,0,0,0,0]
[null,null,1815,1915,null,null,null,null,null,null,null,null,null,null,null,null,null,null,null,null,null,null,null,null,null,null,null,null,null,null,null,null,null,null,null,null,0,0,0,0]
[null,null,1830,1930,null,null,null,null,null,null,null,null,null,null,null,null,null,null,null,null,null,null,null,null,null,null,null,null,null,null,null,null,null,null,null,null,0,0,0,0]
[null,null,1845,1945,null,null,null,null,null,null,null,null,null,null,null,null,null,null,null,null,null,null,null,null,null,null,null,null,null,null,null,null,null,null,null,null,0,0,0,0]

{"sheet":"Volume","index":6,"n_rows":26,"n_cols":3,"rows_kept":26,"cut":false,"hidden":false,"merged":[]}
[]
[null,"Hour","Volume"]
[null,0,{"$f":"IFERROR(ROUND(AVERAGEIF(Input!$A$12:$A$448,0,Input!$C$12:$C$448)*2,0),0)","v":24}]
[null,100,{"$f":"IFERROR(ROUND(AVERAGEIF(Input!$A$12:$A$448,100,Input!$C$12:$C$448)*2,0),0)","v":13}]
[null,200,{"$f":"IFERROR(ROUND(AVERAGEIF(Input!$A$12:$A$448,200,Input!$C$12:$C$448)*2,0),0)","v":8}]
[null,300,{"$f":"IFERROR(ROUND(AVERAGEIF(Input!$A$12:$A$448,300,Input!$C$12:$C$448)*2,0),0)","v":15}]
[null,400,{"$f":"IFERROR(ROUND(AVERAGEIF(Input!$A$12:$A$448,400,Input!$C$12:$C$448)*2,0),0)","v":32}]
[null,500,{"$f":"IFERROR(ROUND(AVERAGEIF(Input!$A$12:$A$448,500,Input!$C$12:$C$448)*2,0),0)","v":151}]
[null,600,{"$f":"IFERROR(ROUND(AVERAGEIF(Input!$A$12:$A$448,600,Input!$C$12:$C$448)*2,0),0)","v":391}]
[null,700,{"$f":"IFERROR(ROUND(AVERAGEIF(Input!$A$12:$A$448,700,Input!$C$12:$C$448)*2,0),0)","v":514}]
[null,800,{"$f":"IFERROR(ROUND(AVERAGEIF(Input!$A$12:$A$448,800,Input!$C$12:$C$448)*2,0),0)","v":749}]
[null,900,{"$f":"IFERROR(ROUND(AVERAGEIF(Input!$A$12:$A$448,900,Input!$C$12:$C$448)*2,0),0)","v":559}]
[null,1000,{"$f":"IFERROR(ROUND(AVERAGEIF(Input!$A$12:$A$448,1000,Input!$C$12:$C$448)*2,0),0)","v":512}]
[null,1100,{"$f":"IFERROR(ROUND(AVERAGEIF(Input!$A$12:$A$448,1100,Input!$C$12:$C$448)*2,0),0)","v":509}]
[null,1200,{"$f":"IFERROR(ROUND(AVERAGEIF(Input!$A$12:$A$448,1200,Input!$C$12:$C$448)*2,0),0)","v":516}]
[null,1300,{"$f":"IFERROR(ROUND(AVERAGEIF(Input!$A$12:$A$448,1300,Input!$C$12:$C$448)*2,0),0)","v":496}]
[null,1400,{"$f":"IFERROR(ROUND(AVERAGEIF(Input!$A$12:$A$448,1400,Input!$C$12:$C$448)*2,0),)","v":612}]
[null,1500,{"$f":"IFERROR(ROUND(AVERAGEIF(Input!$A$12:$A$448,1500,Input!$C$12:$C$448)*2,0),0)","v":817}]
[null,1600,{"$f":"IFERROR(ROUND(AVERAGEIF(Input!$A$12:$A$448,1600,Input!$C$12:$C$448)*2,0),0)","v":879}]
[null,1700,{"$f":"IFERROR(ROUND(AVERAGEIF(Input!$A$12:$A$448,1700,Input!$C$12:$C$448)*2,0),0)","v":876}]
[null,1800,{"$f":"IFERROR(ROUND(AVERAGEIF(Input!$A$12:$A$448,1800,Input!$C$12:$C$448)*2,0),0)","v":618}]
[null,1900,{"$f":"IFERROR(ROUND(AVERAGEIF(Input!$A$12:$A$448,1900,Input!$C$12:$C$448)*2,0),0)","v":347}]
[null,2000,{"$f":"IFERROR(ROUND(AVERAGEIF(Input!$A$12:$A$448,2000,Input!$C$12:$C$448)*2,0),0)","v":232}]
[null,2100,{"$f":"IFERROR(ROUND(AVERAGEIF(Input!$A$12:$A$448,2100,Input!$C$12:$C$448)*2,0),0)","v":154}]
[null,2200,{"$f":"IFERROR(ROUND(AVERAGEIF(Input!$A$12:$A$448,2200,Input!$C$12:$C$448)*2,0),)","v":82}]
[null,2300,{"$f":"IFERROR(ROUND(AVERAGEIF(Input!$A$12:$A$448,2300,Input!$C$12:$C$448)*2,0),0)","v":43}]

{"sheet":"Volume 2","index":7,"n_rows":26,"n_cols":3,"rows_kept":26,"cut":false,"hidden":true,"merged":[]}
[]
[null,"Hour","Volume"]
[null,0,{"$f":"IFERROR(ROUND(AVERAGEIF(Input2!$A$12:$A$448,0,Input2!$C$12:$C$448)*2,0),0)","v":0}]
[null,100,{"$f":"IFERROR(ROUND(AVERAGEIF(Input2!$A$12:$A$448,100,Input2!$C$12:$C$448)*2,0),0)","v":0}]
[null,200,{"$f":"IFERROR(ROUND(AVERAGEIF(Input2!$A$12:$A$448,200,Input2!$C$12:$C$448)*2,0),0)","v":0}]
[null,300,{"$f":"IFERROR(ROUND(AVERAGEIF(Input2!$A$12:$A$448,300,Input2!$C$12:$C$448)*2,0),0)","v":0}]
[null,400,{"$f":"IFERROR(ROUND(AVERAGEIF(Input2!$A$12:$A$448,400,Input2!$C$12:$C$448)*2,0),0)","v":0}]
[null,500,{"$f":"IFERROR(ROUND(AVERAGEIF(Input2!$A$12:$A$448,500,Input2!$C$12:$C$448)*2,0),0)","v":0}]
[null,600,{"$f":"IFERROR(ROUND(AVERAGEIF(Input2!$A$12:$A$448,600,Input2!$C$12:$C$448)*2,0),0)","v":0}]
[null,700,{"$f":"IFERROR(ROUND(AVERAGEIF(Input2!$A$12:$A$448,700,Input2!$C$12:$C$448)*2,0),0)","v":0}]
[null,800,{"$f":"IFERROR(ROUND(AVERAGEIF(Input2!$A$12:$A$448,800,Input2!$C$12:$C$448)*2,0),0)","v":0}]
[null,900,{"$f":"IFERROR(ROUND(AVERAGEIF(Input2!$A$12:$A$448,900,Input2!$C$12:$C$448)*2,0),0)","v":0}]
[null,1000,{"$f":"IFERROR(ROUND(AVERAGEIF(Input2!$A$12:$A$448,1000,Input2!$C$12:$C$448)*2,0),0)","v":0}]
[null,1100,{"$f":"IFERROR(ROUND(AVERAGEIF(Input2!$A$12:$A$448,1100,Input2!$C$12:$C$448)*2,0),0)","v":0}]
[null,1200,{"$f":"IFERROR(ROUND(AVERAGEIF(Input2!$A$12:$A$448,1200,Input2!$C$12:$C$448)*2,0),0)","v":0}]
[null,1300,{"$f":"IFERROR(ROUND(AVERAGEIF(Input2!$A$12:$A$448,1300,Input2!$C$12:$C$448)*2,0),0)","v":0}]
[null,1400,{"$f":"IFERROR(ROUND(AVERAGEIF(Input2!$A$12:$A$448,1400,Input2!$C$12:$C$448)*2,0),)","v":0}]
[null,1500,{"$f":"IFERROR(ROUND(AVERAGEIF(Input2!$A$12:$A$448,1500,Input2!$C$12:$C$448)*2,0),0)","v":0}]
[null,1600,{"$f":"IFERROR(ROUND(AVERAGEIF(Input2!$A$12:$A$448,1600,Input2!$C$12:$C$448)*2,0),0)","v":0}]
[null,1700,{"$f":"IFERROR(ROUND(AVERAGEIF(Input2!$A$12:$A$448,1700,Input2!$C$12:$C$448)*2,0),0)","v":0}]
[null,1800,{"$f":"IFERROR(ROUND(AVERAGEIF(Input2!$A$12:$A$448,1800,Input2!$C$12:$C$448)*2,0),0)","v":0}]
[null,1900,{"$f":"IFERROR(ROUND(AVERAGEIF(Input2!$A$12:$A$448,1900,Input2!$C$12:$C$448)*2,0),0)","v":0}]
[null,2000,{"$f":"IFERROR(ROUND(AVERAGEIF(Input2!$A$12:$A$448,2000,Input2!$C$12:$C$448)*2,0),0)","v":0}]
[null,2100,{"$f":"IFERROR(ROUND(AVERAGEIF(Input2!$A$12:$A$448,2100,Input2!$C$12:$C$448)*2,0),0)","v":0}]
[null,2200,{"$f":"IFERROR(ROUND(AVERAGEIF(Input2!$A$12:$A$448,2200,Input2!$C$12:$C$448)*2,0),)","v":0}]
[null,2300,{"$f":"IFERROR(ROUND(AVERAGEIF(Input2!$A$12:$A$448,2300,Input2!$C$12:$C$448)*2,0),0)","v":0}]

{"sheet":"Count Programme","index":8,"n_rows":22,"n_cols":25,"rows_kept":22,"cut":false,"hidden":true,"merged":[]}
["Count Site ID","Road ID","Road Name","Start","End","Carr_way No.","Start Name","End Name","Width","Number of Lanes","Pavement Type","Use","Traffic Management Level","Region","Area","Sub Area","Urban / Rural","Hierarchy","Final Hierarchy","ADT","Date","Sample Group","2014/15","2015/16","2016/17"]
["ATC1",11044,"WHANGAPARAOA RD  (11044)",3144,3850,6376,"POPLAR RD","DOBELL RD",13.1,2,"Thin Surfaced Flexible","ADT > 20000",">= 10,000 vpd Rural/>=15,000 v",null,"ALBANY","Hibiscus and Bays : Hibiscus Coast","Urban","ROAD - ARTERIAL","Regional",25667,"2013-10-15"]
["ATC2",11044,"WHANGAPARAOA RD  (11044)",3144,3850,6376,"POPLAR RD","DOBELL RD",13.1,2,"Thin Surfaced Flexible","ADT > 20000",">= 10,000 vpd Rural/>=15,000 v",null,"ALBANY","Hibiscus and Bays : Hibiscus Coast","Urban","ROAD - ARTERIAL","Regional",25667,"2013-10-15"]
["ATC3",22320,"GLENCOE RD  (22320)",871,950,8772,"JOHN DOWNS DR","SARTORS AVE",12.8,2,"Thin Surfaced Flexible","ADT 4000-10000","< 10,000 vpd Rural/<15,000 vpd",null,"ALBANY","Hibiscus and Bays : East Coast Bays","Urban","ROAD - COLLECTO","Arterial"]
["ATC4",40827,"HARBOUR VIEW RD (WAITAKERE)  (40827)",0,91,12115,"TE ATATU RD RAB","PRINGLE RD",10.3,2,"Thin Surfaced Flexible","ADT 2000-4000","< 10,000 vpd Rural/<15,000 vpd",null,"WAITAKERE","Henderson-Massey","Urban","ROAD - COLLECTO","Primary Collector",2654,"1986-07-11"]
["ATC5",40827,"HARBOUR VIEW RD (WAITAKERE)  (40827)",91,412,13390,"PRINGLE RD","BEACH RD RAB",10.3,2,"Thin Surfaced Flexible","ADT 2000-4000","< 10,000 vpd Rural/<15,000 vpd",null,"WAITAKERE","Henderson-Massey","Urban","ROAD - COLLECTO","Primary Collector",3183,"2020-10-14"]
["ATC6",40496,"RANUI STATION RD  (40496)",0,233,11547,"SWANSON RD","RANUI SCHOOL RD",10.5,2,"Thin Surfaced Flexible","ADT 2000-4000","< 10,000 vpd Rural/<15,000 vpd",null,"WAITAKERE","Henderson-Massey","Urban","ROAD - LOCAL","Primary Collector",2766,"2008-06-02"]
["ATC7",40496,"RANUI STATION RD  (40496)",233,321,11548,"RANUI SCHOOL RD","ROBERTSON RD",10.5,2,"Thin Surfaced Flexible","ADT 2000-4000","< 10,000 vpd Rural/<15,000 vpd",null,"WAITAKERE","Henderson-Massey","Urban","ROAD - LOCAL","Primary Collector"]
["ATC8",10994,"VIPOND RD (STANMORE BAY)  (10994)",752,1475,4376,"DUNCANSBY RD","COOPER RD",9.8000000000000007,2,"Thin Surfaced Flexible","ADT 4000-10000","< 10,000 vpd Rural/<15,000 vpd",null,"ALBANY","Hibiscus and Bays : Hibiscus Coast","Urban","ROAD - COLLECTO","Arterial",6694,"2011-11-11"]
["ATC9",10994,"VIPOND RD (STANMORE BAY)  (10994)",752,1475,4376,"DUNCANSBY RD","COOPER RD",9.8000000000000007,2,"Thin Surfaced Flexible","ADT 4000-10000","< 10,000 vpd Rural/<15,000 vpd",null,"ALBANY","Hibiscus and Bays : Hibiscus Coast","Urban","ROAD - COLLECTO","Arterial",6694,"2011-11-11",null,null,"2024-11-11"]
["ATC10",40259,"WAIPAREIRA AVE  (40259)",0,220,11019,"TE PAI PL","MOSELLE AVE",11,2,"Thin Surfaced Flexible","ADT 2000-4000","< 10,000 vpd Rural/<15,000 vpd",null,"WAITAKERE","Henderson-Massey","Urban","ROAD - LOCAL","Secondary Collector",3090,"1993-05-31"]
["ATC11",40259,"WAIPAREIRA AVE  (40259)",0,220,11019,"TE PAI PL","MOSELLE AVE",11,2,"Thin Surfaced Flexible","ADT 2000-4000","< 10,000 vpd Rural/<15,000 vpd",null,"WAITAKERE","Henderson-Massey","Urban","ROAD - LOCAL","Secondary Collector",3090,"1993-05-31"]
["ATC12",40519,"POOKS RD  (40519)",0,225,11576,"METCALFE RD","PUTNEY PL",8,2,"Thin Surfaced Flexible","ADT 2000-4000","< 10,000 vpd Rural/<15,000 vpd",null,"WAITAKERE","Henderson-Massey","Urban","ROAD - LOCAL","Primary Collector",3438,"2008-07-07"]
["ATC13",40519,"POOKS RD  (40519)",225,559,11577,"PUTNEY PL","RANUI AVE",8,2,"Thin Surfaced Flexible","ADT 2000-4000","< 10,000 vpd Rural/<15,000 vpd",null,"WAITAKERE","Henderson-Massey","Urban","ROAD - LOCAL","Secondary Collector",3870,"2014-06-12"]
["ATC14",20438,"LINGFIELD ST  (20438)",0,487,7575,"CHARTWELL AVE","BLENHEIM ST",8,2,"Thin Surfaced Flexible","ADT 500-2000","< 10,000 vpd Rural/<15,000 vpd",null,"NORTH SHORE","Kaipatiki","Urban","ROAD - LOCAL","Secondary Collector",1885,"2014-05-08"]
["ATC15",20438,"LINGFIELD ST  (20438)",0,487,7575,"CHARTWELL AVE","BLENHEIM ST",8,2,"Thin Surfaced Flexible","ADT 500-2000","< 10,000 vpd Rural/<15,000 vpd",null,"NORTH SHORE","Kaipatiki","Urban","ROAD - LOCAL","Secondary Collector",1885,"2014-05-08"]
["ATC16",40485,"RED HILLS RD (MASSEY)  (40485)",0,422,13372,"DON BUCK RD RAB","BIRDWOOD RD",6.8,2,"Thin Surfaced Flexible","ADT 4000-10000","< 10,000 vpd Rural/<15,000 vpd",null,"WAITAKERE","Henderson-Massey","Urban","ROAD - COLLECTO","Arterial",8828,"2022-03-29"]
["ATC17",40844,"GREAT NORTH RD (WAITAKERE)  (40844)",3841,4308,13225,"PALMER AVE","HEPBURN RD",15,4,"Thin Surfaced Flexible","ADT > 20000",">= 15,000 vpd Urban road, low",null,"WHAU","Whau","Urban","ROAD - ARTERIAL","Regional",32184,"2023-05-29"]
["ATC18",40844,"GREAT NORTH RD (WAITAKERE)  (40844)",3841,4308,13225,"PALMER AVE","HEPBURN RD",15,4,"Thin Surfaced Flexible","ADT > 20000",">= 15,000 vpd Urban road, low",null,"WHAU","Whau","Urban","ROAD - ARTERIAL","Regional",32184,"2023-05-29"]
["ATC19",40442,"SCENIC DR (TITIRANGI)  (40442)",9593,9713,11424,"QUINNS RD","SPEED DERESTRICTION",6,2,"Thin Surfaced Flexible","ADT 500-2000","< 10,000 vpd Rural/<15,000 vpd",null,"WAITAKERE","Waitakere Ranges","Rural","ROAD - ARTERIAL","Primary Collector",607,"2019-08-12"]
["ATC20",40442,"SCENIC DR (TITIRANGI)  (40442)",9170,9593,11423,"WEST COAST RD (START ISLAND RHS)","QUINNS RD",7.5,2,"Thin Surfaced Flexible","ADT 500-2000","< 10,000 vpd Rural/<15,000 vpd",null,"WAITAKERE","Waitakere Ranges","Rural","ROAD - ARTERIAL","Primary Collector",2781,"2019-08-12"]
["ATC21",40533,"PIHA RD  (40533)",0,300,13317,"SCENIC DR (QUINNS RD)","SPEED DERESTRICTION",6,2,"Thin Surfaced Flexible","ADT 2000-4000","< 10,000 vpd Rural/<15,000 vpd",null,"WAITAKERE","Waitakere Ranges","Rural","ROAD - ARTERIAL","Arterial",2210,"2019-08-12"]