{"text_format":"1","workbook":"xlsx","n_sheets":36,"sheets":["Instructions",">>Input tabs","Control","UHCC Adjustments","Capital values","CV Analysis ","ESSbase","Class Rates",">>District wide rates","Gen","River management","Stadium","WRS","Public transport",">>Other rates & levies","Pest","Water levy",">>Output tabs","Comparison - TA","Comparison - Category","Rates Check - ex-KCDC &  UHC","Rates Check - UHC","Rates Check - KCDC","Checks",">>Rates","1","2","3","4","5","5b","6","Impact","Changes","Mechanisms","For IT"],"not_rendered":{"charts":0,"images":3,"macros":1,"external_links":7,"defined_names":119,"comments":8,"pivot_tables":0},"unopened":[],"bounds":{"document_bytes":16777216,"sheet_cells":100000,"rows_first":2000,"rows_last":500,"rows_between":2000,"halvings":0,"cell_chars":16384,"cell_head_chars":4096},"cells_cut":0,"cells_raw":0,"read":"whole","date_system":"1900"}

{"sheet":"Instructions","index":0,"n_rows":29,"n_cols":4,"rows_kept":29,"cut":false,"hidden":false,"merged":[[23,2,23,13],[24,2,24,13],[3,0,3,13],[12,2,12,14],[18,2,18,13],[20,2,20,13],[22,2,22,13]]}
["Instructions"]
[]
["Purpose"]
["This rating model is prepared to determine the rates sought by each rating category/TA to cover funding requirements for the forthcoming year."]
[]
["Conventions"]
{"$rows_left_out":24}
{"sheet":">>Input tabs","index":1,"n_rows":0,"n_cols":0,"rows_kept":0,"cut":false,"hidden":false,"merged":[]}

{"sheet":"Control","index":2,"n_rows":190,"n_cols":20,"rows_kept":190,"cut":false,"hidden":false,"merged":[]}
["Control"]
[{"$f":"check_total","v":0}]
[]
["Years"]
["Current rating year","2019/20"]
["Previous rating year",{"$f":"VALUE(LEFT(year_current,4))-1&\"/\"&VALUE(RIGHT(year_current,2))-1","v":"2018/19"}]
{"$rows_left_out":185}
{"sheet":"UHCC Adjustments","index":3,"n_rows":34,"n_cols":5,"rows_kept":34,"cut":false,"hidden":false,"merged":[]}
["Wellington Regional Council"]
[{"$f":"\"UHCC Adjustments \"&year_current","v":"UHCC Adjustments 2019/20"}]
["Printed:",{"$f":"NOW()","v":"2019-05-10T11:15:31.730"}]
[{"$f":"check_total","v":0}]
[]
["TA full name","Category group","Sub category group","CV","Rateable Land Value"]
{"$rows_left_out":29}
{"sheet":"Capital values","index":4,"n_rows":143,"n_cols":15,"rows_kept":143,"cut":false,"hidden":false,"merged":[]}
["Wellington Regional Council"]
["Rateable values"]
[{"$f":"check_total","v":0}]
[]
["Capital values"]
[{"$f":"Control!A41","v":"TA full name"},"Rating area",{"$f":"Control!B41","v":"Category group"},{"$f":"Control!C41","v":"Concatenated  row"},{"$f":"\"CV \"&year_previous","v":"CV 2018/19"},{"$f":"\"CV \"&year_current","v":"CV 2019/20"},{"$f":"\"ECV \"&year_previous","v":"ECV 2018/19"},{"$f":"\"ECV \"&year_current","v":"ECV 2019/20"},null,"Check CV","Check ECV","ECV 2018/19","ECV 2019/20","change"]
{"$rows_left_out":138}
{"sheet":"CV Analysis ","index":5,"n_rows":43,"n_cols":19,"rows_kept":43,"cut":false,"hidden":false,"merged":[[26,18,28,18],[29,18,31,18],[6,18,9,34],[10,18,12,18],[13,18,15,34],[16,18,18,34],[19,18,21,18],[23,18,25,24]]}
["Greater Wellington Regional Council"]
["Analysis of Capital Value and Assessments"]
[]
[]
[null,null,"Capital Values 2018/19","Capital Values 2019/20",null,{"$f":"\"CV assessments \"&year_previous","v":"CV assessments 2018/19"},{"$f":"\"CV assessments \"&year_current","v":"CV assessments 2019/20"},null,{"$f":"\"Contiguous assements \"&year_previous","v":"Contiguous assements 2018/19"},{"$f":"\"Contiguous assements \"&year_current","v":"Contiguous assements 2019/20"},null,"CV Average 2018/19","CV Average 2019/20",null,"CV Average movement","change in CV","change in assessment ",null,"Comments"]
[]
{"$rows_left_out":38}
{"sheet":"ESSbase","index":6,"n_rows":52,"n_cols":11,"rows_kept":52,"cut":false,"hidden":false,"merged":[[2,0,2,1]]}
["Wellington Regional Council"]
["ESSBase values"]
[{"$f":"check_total","v":0}]
[]
[null,"Model naming convention","Essbase name","Essbase name",null,"Last Year Base","Current Year Base","total",null,"Proposed Budget Base"]
[null,null,null,null,null,"2018/19","2019/20","2019/20",null,"2019/20"]
{"$rows_left_out":47}
{"sheet":"Class Rates","index":7,"n_rows":165,"n_cols":13,"rows_kept":165,"cut":false,"hidden":false,"merged":[[161,1,161,8]]}
["Wellington Regional Council"]
[{"$f":"\"Class rates \"&year_current","v":"Class rates 2019/20"}]
["Printed :",{"$f":"NOW()","v":"2019-05-10T11:15:31.730"}]
[{"$f":"check_total","v":0}]
[]
["2016-12-01","Revenue Required",null,"Class","$ per Hectare","Class Total","Class Areas","Scheme Total","Var"]
{"$rows_left_out":160}
{"sheet":">>District wide rates","index":8,"n_rows":8,"n_cols":12,"rows_kept":8,"cut":false,"hidden":false,"merged":[]}
[]
[]
[]
[]
[]
[]
{"$rows_left_out":3}
{"sheet":"Gen","index":9,"n_rows":40,"n_cols":7,"rows_kept":40,"cut":false,"hidden":false,"merged":[]}
["Wellington Regional Council"]
[{"$f":"\"General rate \"&year_current","v":"General rate 2019/20"}]
["Printed: ",{"$f":"NOW()","v":"2019-05-10T11:15:31.730"}]
[{"$f":"check_total","v":0}]
[]
[null,"CV",{"$f":"\"ECV \"&year_current","v":"ECV 2019/20"},"General Rate","Rates sought"]
{"$rows_left_out":35}
{"sheet":"River management","index":10,"n_rows":36,"n_cols":4,"rows_kept":36,"cut":false,"hidden":false,"merged":[]}
["Wellington Regional Council"]
[{"$f":"\"River management rate \"&year_current","v":"River management rate 2019/20"}]
["Printed: ",{"$f":"NOW()","v":"2019-05-10T11:15:31.730"}]
[{"$f":"check_total","v":0}]
[]
[null,"CV","River management rate","Rates sought"]
{"$rows_left_out":31}
{"sheet":"Stadium","index":11,"n_rows":66,"n_cols":8,"rows_kept":66,"cut":false,"hidden":false,"merged":[]}
["Wellington Regional Council"]
[{"$f":"\"Stadium purposes rate \"&year_current","v":"Stadium purposes rate 2019/20"}]
["Printed: ",null,{"$f":"NOW()","v":"2019-05-10T11:15:31.730"}]
[{"$f":"check_total","v":0}]
[]
[{"$f":"Control!A66","v":"TA full name"},{"$f":"Control!B66","v":"Rating area"},{"$f":"Control!C66","v":"Category group"},{"$f":"Control!D66","v":"Concatenated  name"},{"$f":"\"Allocation \"&year_current","v":"Allocation 2019/20"},"CV","Stadium purposes rate","Rates sought"]
{"$rows_left_out":61}
{"sheet":"WRS","index":12,"n_rows":54,"n_cols":19,"rows_kept":54,"cut":false,"hidden":false,"merged":[]}
["Wellington Regional Council"]
[{"$f":"\"Wellington regional strategy rate \"&year_current","v":"Wellington regional strategy rate 2019/20"}]
["Printed: ",{"$f":"NOW()","v":"2019-05-10T11:15:31.730"}]
[{"$f":"check_total","v":0}]
[]
[{"$f":"Control!A66","v":"TA full name"},{"$f":"Control!B66","v":"Rating area"},{"$f":"Control!C66","v":"Category group"},{"$f":"Control!D66","v":"Concatenated  name"},"CV assessments","Contiguous assements","Rateable properties","Rating basis","CV","ECV","Wellington regional strategy rate","Rates sought"]
{"$rows_left_out":49}
{"sheet":"Public transport","index":13,"n_rows":66,"n_cols":10,"rows_kept":66,"cut":false,"hidden":false,"merged":[]}
["Wellington Regional Council"]
[{"$f":"\"Public transport rate \"&year_current","v":"Public transport rate 2019/20"}]
["Printed: ",{"$f":"NOW()","v":"2019-05-10T11:15:31.730"}]
[{"$f":"check_total","v":0}]
[]
[{"$f":"Control!A41","v":"TA full name"},null,{"$f":"Control!B41","v":"Category group"},{"$f":"Control!C41","v":"Concatenated  row"},{"$f":"\"CV\"","v":"CV"},"ECV","Differential","ECV multiplied","Public transport rate","Rates sought"]
{"$rows_left_out":61}
{"sheet":">>Other rates & levies","index":14,"n_rows":0,"n_cols":0,"rows_kept":0,"cut":false,"hidden":false,"merged":[]}

{"sheet":"Pest","index":15,"n_rows":21,"n_cols":4,"rows_kept":21,"cut":false,"hidden":false,"merged":[]}
["Wellington Regional Council"]
[{"$f":"\"Pest management rate \"&year_current","v":"Pest management rate 2019/20"}]
["Printed: ",{"$f":"NOW()","v":"2019-05-10T11:15:31.730"}]
[{"$f":"check_total","v":0}]
[]
["TA full name","Area ha","$ per Hectare","Pest management rate"]
{"$rows_left_out":16}
{"sheet":"Water levy","index":16,"n_rows":21,"n_cols":3,"rows_kept":21,"cut":false,"hidden":false,"merged":[]}
["Wellington Regional Council"]
[{"$f":"\"Water supply levy \"&year_current","v":"Water supply levy 2019/20"}]
["Printed :",{"$f":"NOW()","v":"2019-05-10T11:15:31.730"}]
[{"$f":"check_total","v":0}]
[]
[null,"Share","Bulk Water Levies"]
{"$rows_left_out":16}
{"sheet":">>Output tabs","index":17,"n_rows":0,"n_cols":0,"rows_kept":0,"cut":false,"hidden":false,"merged":[]}

{"sheet":"Comparison - TA","index":18,"n_rows":70,"n_cols":13,"rows_kept":70,"cut":false,"hidden":false,"merged":[[27,1,27,11],[4,1,4,11],[50,1,50,11],[4,0,5,0],[27,0,28,0],[50,0,51,0]]}
["Comparison of proposed vs current"]
[{"$f":"check_total","v":0}]
[]
[{"$f":"year_previous&\" rates\"","v":"2018/19 rates"}]
[null,"TA"]
[null,"Wellington city","Hutt city","Upper Hutt city","Porirua city","Kāpiti Coast district","Masterton District","Carterton District","South Wairarapa District","Tararua District","Other","Region wide"]
{"$rows_left_out":65}
{"sheet":"Comparison - Category","index":19,"n_rows":179,"n_cols":29,"rows_kept":179,"cut":false,"hidden":false,"merged":[[1,0,1,3],[5,23,5,28],[64,23,64,28],[123,23,123,28],[64,9,64,14],[64,16,64,21],[5,9,5,14],[5,16,5,21],[123,9,123,14],[123,16,123,21]]}
["Comparison of proposed vs current"]
[{"$f":"check_total","v":0}]
[]
[]
[{"$f":"year_previous&\" rates\"","v":"2018/19 rates"}]
[null,null,null,null,null,null,null,null,null,"Rates",null,null,null,null,null,null,"Rates for average property",null,null,null,null,null,null,"Cents/$ OR Regional Strategy Rate $/property"]
{"$rows_left_out":174}
{"sheet":"Rates Check - ex-KCDC &  UHC","index":20,"n_rows":47,"n_cols":9,"rows_kept":47,"cut":false,"hidden":false,"merged":[[26,0,27,0],[7,3,7,5],[6,7,6,8],[6,3,6,5],[17,0,20,0],[13,0,16,0],[21,0,22,0]]}
["Wellington Regional Council"]
[{"$f":"B5&\" Check \"&year_current","v":"South Wairarapa district Check 2019/20"}]
[{"$f":"check_total","v":0}]
["Printed: ",{"$f":"NOW()","v":"2019-05-10T11:15:31.730"}]
["TA to view","South Wairarapa district"]
[]
{"$rows_left_out":42}
{"sheet":"Rates Check - UHC","index":21,"n_rows":58,"n_cols":9,"rows_kept":58,"cut":false,"hidden":false,"merged":[[26,0,27,0],[47,0,49,0],[50,0,52,0],[6,3,6,5],[6,7,6,8],[7,3,7,5],[13,0,16,0],[17,0,20,0],[21,0,22,0]]}
["Wellington Regional Council"]
[{"$f":"B5&\" Check \"&year_current","v":"Upper Hutt city Check 2019/20"}]
[{"$f":"check_total","v":0}]
["Printed: ",{"$f":"NOW()","v":"2019-05-10T11:15:31.730"}]
["TA to view","Upper Hutt city"]
[]
{"$rows_left_out":53}
{"sheet":"Rates Check - KCDC","index":22,"n_rows":43,"n_cols":9,"rows_kept":43,"cut":false,"hidden":false,"merged":[[23,0,24,0],[28,0,29,0],[6,3,6,5],[6,7,6,8],[7,3,7,5],[13,0,17,0],[18,0,22,0]]}
["Wellington Regional Council"]
[{"$f":"B5&\" Check \"&year_current","v":"Kāpiti Coast district Check 2019/20"}]
[{"$f":"check_total","v":0}]
["Printed: ",{"$f":"NOW()","v":"2019-05-10T11:15:31.730"}]
["TA to view","Kāpiti Coast district"]
[]
{"$rows_left_out":38}
{"sheet":"Checks","index":23,"n_rows":46,"n_cols":4,"rows_kept":46,"cut":false,"hidden":false,"merged":[[2,0,2,1]]}
["Wellington Regional Council"]
["Value checks"]
[{"$f":"check_total","v":0}]
[]
["Tab/component","Check",null,"Check notes"]
[]
{"$rows_left_out":41}
{"sheet":">>Rates","index":24,"n_rows":0,"n_cols":0,"rows_kept":0,"cut":false,"hidden":false,"merged":[]}

{"sheet":"1","index":25,"n_rows":47,"n_cols":11,"rows_kept":47,"cut":false,"hidden":false,"merged":[[45,0,45,4],[46,0,46,4],[2,0,2,4],[3,0,3,4],[5,0,5,4],[7,0,7,4],[4,0,4,4],[9,0,9,4],[44,0,44,4]]}
["Summary of Rates and Water Levies"]
[]
["Rates for Greater Wellington are mostly allocated to ratepayers on the basis of their capital values. Within the region, different territorial authorities undertake general revaluations at different times. To equalise the values, each year Council gets Quotable Value or another registered valuer to estimate the projected valuations of all the rateable land in the districts within the region. This means that rates are assessed on a consistent valuation basis, regardless of the timing of individual territorial authority revaluations."]
["The summary information in this section should be read in conjunction with the Funding Impact Statement and the Revenue and Financing policy. \n"]
["All figures on this page exclude GST."]
[{"$f":"\"This table shows the rates and levies for GWRC in \"&year_current&\", with the changes from last year \"&year_previous&\". Rates comprise the general rate and various targeted rates. GWRC also charges a water supply levy directly to the four city councils in the region, and they set their own rates to cover the cost of this levy.\"","v":"This table shows the rates and levies for GWRC in 2019/20, with the changes from last year 2018/19. Rates comprise the general rate and various targeted rates. GWRC also charges a water supply levy directly to the four city councils in the region, and they set their own rates to cover the cost of this levy."}]
{"$rows_left_out":42}
{"sheet":"2","index":26,"n_rows":45,"n_cols":11,"rows_kept":45,"cut":false,"hidden":false,"merged":[[42,0,42,4],[43,0,43,4],[44,0,44,4],[2,0,4,4],[7,0,7,4]]}
["Impact on each City and District"]
[]
["Rates increases vary among cities and districts  because of differing equalised capital values. Targeted  rates are applied according to the Revenue and Financing policy. The next page shows the different rates paid in each city and district. "]
[]
[]
["All figures on this page exclude GST."]
{"$rows_left_out":40}
{"sheet":"3","index":27,"n_rows":163,"n_cols":25,"rows_kept":163,"cut":false,"hidden":false,"merged":[[8,12,9,13],[8,14,9,15],[8,2,9,3],[8,4,9,5],[8,10,9,11],[8,8,9,9],[8,6,9,7],[44,0,45,19],[46,0,46,19],[27,0,28,15],[25,0,25,3],[53,0,54,15],[51,0,52,15],[58,0,59,15],[48,0,49,19],[132,8,132,9],[132,6,132,7],[132,4,132,5]]}
["PAGE NOT USED"]
[]
["RATES AND LEVIES - REGION-WIDE CHANGES BY CITY AND RATE TYPE"]
["WHAT IS THE IMPACT ON YOUR CITY OR DISTRICT?"]
[]
[]
{"$rows_left_out":158}
{"sheet":"4","index":28,"n_rows":53,"n_cols":21,"rows_kept":53,"cut":false,"hidden":false,"merged":[[10,15,10,17],[10,3,10,5],[10,9,10,11],[10,6,10,8],[10,12,10,14],[11,15,11,17],[47,0,47,23],[52,0,53,23],[49,0,50,23],[30,15,30,17],[27,0,28,23],[31,15,31,17],[11,3,11,5]]}
["PAGE NOT USED"]
[]
["RATES AND LEVIES - REGION-WIDE TOTAL RATES BY CITY AND RATE TYPE"]
[{"$f":"+'3'!A4","v":"WHAT IS THE IMPACT ON YOUR CITY OR DISTRICT?"}]
[]
[]
{"$rows_left_out":48}
{"sheet":"5","index":29,"n_rows":44,"n_cols":17,"rows_kept":44,"cut":false,"hidden":false,"merged":[[17,12,17,13],[31,0,31,1],[31,10,31,11],[31,8,31,9],[31,4,31,5],[31,6,31,7],[43,0,43,11],[31,2,31,3],[17,10,17,11],[17,2,17,3],[17,6,17,7],[17,8,17,9],[17,4,17,5],[17,0,17,1]]}
["Residential region-wide rates"]
["All figures on this page include GST"]
[]
["Average value of residential property in each city or district"]
[null,null,{"$f":"year_previous","v":"2018/19"},{"$f":"year_current","v":"2019/20"}]
["Wellington city",null,{"$f":"INDEX('Comparison - Category'!$H$22:$H$49,MATCH($A6&\"residential\",'Comparison - Category'!$D$22:$D$49,0),)","v":554459.5066612442},{"$f":"INDEX('Comparison - Category'!$H$81:$H$108,MATCH($A6&\"residential\",'Comparison - Category'!$D$81:$D$108,0),)","v":800545.26285746112}]
{"$rows_left_out":39}
{"sheet":"5b","index":30,"n_rows":40,"n_cols":6,"rows_kept":40,"cut":false,"hidden":false,"merged":[[1,0,1,5],[3,1,3,2],[3,3,3,4],[8,6,9,6],[8,7,9,7]]}
["Average rates for each area and category "]
["These tables show the region-wide rates that are charged to all ratepayers in the region. They exclude targeted rates for pest management, Wairarapa river and drainage schemes, and \"Warm Greater Wellington\", because those rates only apply to highly specific ratepayers in those work programmes."]
[]
[]
["Residential, including GST","Average capital value",{"$f":"\"Increase in \"& year_current","v":"Increase in 2019/20"},"Increase \nper week",{"$f":"\"Rates         \"&year_current","v":"Rates         2019/20"},"Rates\nper week"]
["Wellington city",{"$f":"INDEX(Changes!C$66:C$74,MATCH($A6,Changes!$B$66:$B$74,0),)","v":800545.26285746112},{"$f":"INDEX(Changes!D$66:D$74,MATCH($A6,Changes!$B$66:$B$74,0),)","v":46.204411763828084},{"$f":"INDEX(Changes!E$66:E$74,MATCH($A6,Changes!$B$66:$B$74,0),)","v":0.88854638007361697},{"$f":"INDEX(Changes!F$66:F$74,MATCH($A6,Changes!$B$66:$B$74,0),)","v":564.2871055512386},{"$f":"INDEX(Changes!G$66:G$74,MATCH($A6,Changes!$B$66:$B$74,0),)","v":10.851675106754588}]
{"$rows_left_out":35}
{"sheet":"6","index":31,"n_rows":23,"n_cols":9,"rows_kept":23,"cut":false,"hidden":false,"merged":[[2,0,2,8],[3,0,3,8],[22,0,22,8]]}
["Rates calculator - Residential region-wide1 rates"]
[]
["To calculate region-wide rates for all property types, use the calculator on our website http://www.gw.govt.nz/regional-rates-calculator/"]
["Note: These calculations do not include GWRC targeted rates that are specific to individual properties, and they do not include rates set by city or district councils. Greater Wellington rates are set and assessed by Greater Wellington but are invoiced and collected by the relevant city and district Council within the region. This combined collection arrangement is cost effective and more convenient for ratepayers. "]
[]
[null,{"$f":"year_current&\" region-wide rates per $100,000 of capital value\"","v":"2019/20 region-wide rates per $100,000 of capital value"},null,"Enter the capital value of your property",null,null,"Wellington regional strategy rate",null,{"$f":"\"Indicative rates on your property for \"&year_current&\" 1\"","v":"Indicative rates on your property for 2019/20 1"}]
{"$rows_left_out":18}
{"sheet":"Impact","index":32,"n_rows":265,"n_cols":19,"rows_kept":265,"cut":false,"hidden":false,"merged":[[161,6,162,6],[246,0,247,0],[247,2,248,2],[158,0,159,0],[247,4,248,4],[198,2,199,2],[236,0,237,0],[159,4,160,4],[197,0,198,0],[237,2,238,2],[237,4,238,4],[198,4,199,4],[159,2,160,2],[158,6,159,6],[8,2,10,2],[8,9,10,9],[8,4,9,4],[8,11,9,11],[7,0,8,0],[7,6,8,6],[159,8,160,8],[159,9,160,9],[111,11,112,11],[62,9,64,9],[111,9,112,9],[62,8,64,8],[262,9,262,10],[237,9,238,9],[258,9,258,10],[198,9,199,9],[197,6,198,6],[204,6,206,6],[214,6,217,6],[49,11,50,11],[49,9,50,9],[198,11,199,11],[215,11,216,11],[236,6,237,6],[205,11,206,11],[237,11,238,11],[205,9,206,9],[215,9,217,9],[223,6,231,11],[63,7,64,7],[159,11,160,11],[110,6,111,6],[48,6,49,6],[61,6,62,7],[62,11,63,11],[113,0,114,0],[48,4,50,4],[48,2,50,2],[29,4,31,4],[29,2,31,2],[28,0,29,0],[47,0,48,0],[114,4,115,4],[114,2,115,2]]}
["Wellington Regional Council"]
[{"$f":"\"Rates tables for annual plan \"&year_current","v":"Rates tables for annual plan 2019/20"}]
["Printed :",{"$f":"NOW()","v":"2019-05-10T11:15:31.730"}]
[{"$f":"check_total","v":0}]
[null,null,null,null,null,null,null,null,null,null,null,"Rates funding impact statement"]
[]
{"$rows_left_out":260}
{"sheet":"Changes","index":33,"n_rows":148,"n_cols":13,"rows_kept":148,"cut":false,"hidden":false,"merged":[[5,3,6,3],[5,4,6,4],[7,6,7,8],[14,6,14,8],[53,2,53,12],[46,2,46,12],[39,2,39,12],[32,2,32,12],[20,2,20,12],[27,2,27,12]]}
[{"$f":"year_current&\" Final Rates Averages\"","v":"2019/20 Final Rates Averages"}]
["Greater Wellington Region"]
[]
[]
[null,null,null,{"$f":"year_previous","v":"2018/19"},{"$f":"year_current","v":"2019/20"},null,{"$f":"year_previous","v":"2018/19"},{"$f":"year_current","v":"2019/20"}]
[null,null,null,"Average CV","Average CV",null,"Budget","Plan","Change","Change"]
{"$rows_left_out":143}
{"sheet":"Mechanisms","index":34,"n_rows":19,"n_cols":8,"rows_kept":19,"cut":false,"hidden":false,"merged":[[14,0,14,4],[18,0,18,4],[16,0,16,4]]}
["Rating mechanisms"]
["Funding mechanism","Groups of activities funded","Valuation system","Matters for differentiation/categories of land","Calculation factor","Years used"]
["General rate"]
["General rate","All Groups of activities except Public Transport are funded to some extent by this rate. Activities that are not funded are Warm Greater Wellington and the Wellington Regional Strategy.","Capital value","Where the land is situated.","Cents per dollar of rateable capital value","2018-2028",null,"Only display column f for LTP year"]
["Targeted rates"]
["Wellington Regional Strategy","Regional Leadership","Business category - capital value\nResidential and Rural categories - not based on value","Where the land is situated and the use to which the land is put.","Business - cents per dollar of rateable capital value\nResidential - fixed dollar amount per rating unit\nRural - fixed dollar amount per rating unit","2018-2028"]
{"$rows_left_out":14}
{"sheet":"For IT","index":35,"n_rows":158,"n_cols":19,"rows_kept":158,"cut":false,"hidden":false,"merged":[]}
["Wellington Regional Council"]
["Figures for IT to upload to website"]
[]
["Rate_Class_ID","Rate_Class_Name","Model"]
[1,"Residential","Residential"]
[2,"Business","Business",null,null,null,null,null,null,null,"per $",null,"Model name","Rate","Look up rate name","Category"]
{"$rows_left_out":152}